Year,Jurisdiction,Jur_Name,Parcel_ID,Account,Ownership_Sequence,Owner_Id,Owner_Prefix,Name,Careof,Street,Street_Overflow,City,State,Zip5,Zip4,Location_Code,Jur 1,Jur 2,Jur 3,Jur 4,Jur 5,Jur 6,Jur 7,Jur 8,Jur 9,Jur 10,Jur 11,Jur 12,Is_Exempt,Prop_Street_Number,Prop_Street,Prop_Street_Dir,Prop_City,Prop_State,Prop_Zip5,Prop_Zip4,Map1,Map2,Is_Protested,Has_Hs_Link,Primary_Category_Code,Secondary_Category_Code,Third_Category_Code,DBA,Route_Code,Route_Order,Route_SubOrder,Interest,Ceiling_Year,Ceiling_Tax,Homestead_Code,Agent_Code,Agent_Mailing,Agent_Name,Agent_Address1,Agent_Address2,Agent_City,Agent_State,Agent_Zip5,Agent_Zip4,Acres,Legal1,Legal2,Legal3,Legal4,Mortgage_Code,Lease_Number,Lease_Name,Operator_Name,RRC_Number,Interest_Type,Land_Hs,Land_Nhs,Land_Productivity_Market,Land_1d1,Land_1d,Land_Timber,Personal_Hs,Personal_Nhs,New_Personal_Hs,New_Personal_Nhs,Improvement_Hs,New_Improvement_Hs,Improvement_Nhs,New_Improvement_Nhs,Income_Land,Income_Improvement,Market_Value,Net_Taxable_Value,State_Homestead,State_Mandated_Over65,State_Mandated_Disabled,Optional65,Local_Disabled,Road_Homestead,Disabled_Veteran,Is_Owner_Confidential,Local_Discount,Has_Abatement,Has_Miscellaneous_Exemption,Abatement_Value,Mineral_Freeport_Value,Mineral_Unknown_Value
2023,00,PECOS COUNTY APPR DIST,4,01680-00100-01000-001156,1,31125,R,VAQUERO HOMES LLC,,1400 BELLEVILLE STREET,,RICHMOND,VA,23230,,16M,00,01,31,10,63,66,,MCP,,,,,False,735,US HWY 285,S,FORT STOCKTON,TX,79735,,,,False,False,M1,,,,,0,,1.000000,0,0.00,,,0,,,,,,,,0.0000,LOCATED MOBILE HOME,ROAD RUNNER RV PARK,SPOT #108,SAN JACINTO,,,,,,,0,0,0,0,0,0,0,0,0,0,0,0,6290,0,0,0,6290,6290,0,0,0,0,0,0,0,False,0,False,False,0,0,0
2023,00,PECOS COUNTY APPR DIST,8,00001-08015-06210-001240,1,536,R,BASSHAM JOE,,1305 W 45TH LANE,,FT STOCKTON,TX,79735,9610,18M,00,01,31,63,66,,,MCP,,,,,False,1727,48 LANE,E,FORT STOCKTON,TX,79735,,,,False,False,M1,,,,,0,,1.000000,0,0.00,,,0,,,,,,,,0.0000,LOCATED MOBILE HOME,W/2 -62,BLK 1 FSIL,SEC 15,,,,,,,0,0,0,0,0,0,0,0,0,0,21520,0,0,0,0,0,21520,21520,0,0,0,0,0,0,0,False,0,False,False,0,0,0
2023,00,PECOS COUNTY APPR DIST,10,00011-02119-00100-001278,1,894,R,BRADLEY BARBARA,,P O BOX 944,,MCCAMEY,TX,79752,,12M,00,01,30,63,66,,,MCP,,,,,False,,SUN VALLEY FARM,,,,,,,,False,False,M1,,,,,0,,1.000000,0,0.00,,,0,,,,,,,,0.0000,LOCATED        MOBILE HOME,BLK 11         H&GN,SEC 119,,,,,,,,0,0,0,0,0,0,0,0,0,0,0,0,35490,0,0,0,35490,35490,0,0,0,0,0,0,0,False,0,False,False,0,0,0
2023,00,PECOS COUNTY APPR DIST,12,00001-08009-06301-000000,1,858,R,BOWLES CHARLES R JR,,P O BOX 714,,FT STOCKTON,TX,79735,0714,18M,00,01,31,63,66,,,MCP,,,,,False,,44 LANE,,FORT STOCKTON,TX,79735,,,,False,False,A2,,,,,0,,1.000000,0,0.00,H,,0,,,,,,,,0.6230,PT TR 63   1  FSIL  SEC 9,SE,,,,,,,,,1250,0,0,0,0,0,0,0,0,0,21320,0,0,0,0,0,22570,16310,0,0,0,0,0,0,0,False,0,False,False,0,0,0
2023,00,PECOS COUNTY APPR DIST,14,00008-00017-01000-001339,1,893,R,BRADEN KELLEY,ALVIN BRADEN,P O BOX 127,,COYANOSA,TX,79730,0127,12M,00,01,30,63,66,,,MCP,,,,,False,,HWY 1450,,COYANOSA,TX,79730,,,,False,False,M1,,,,,0,,1.000000,0,0.00,H,,0,,,,,,,,0.0000,LOCATED        MOBILE HOME,BLK 8   H&GN  SEC 17,,,,,,,,,0,0,0,0,0,0,0,0,0,0,51670,0,0,0,0,0,51670,29550,0,0,0,0,0,0,0,False,0,False,False,0,0,0
2023,00,PECOS COUNTY APPR DIST,15,00001-03063-00900-001352,1,6339,R,PECOS COUNTY,,103 W CALLAGHAN,,FT STOCKTON,TX,79735,,21M,00,01,32,12,63,65,,MCP,,,,,True,104,UNDERWOOD,S,IRAAN,TX,79744,,,,False,False,XV,,,SHERIFF'S OFFICE,,0,,1.000000,0,0.00,,,0,,,,,,,,0.0000,LOCATED       OFFICE ONLY,INDUSTRIAL PARK,,,,,,,,,0,0,0,0,0,0,0,0,0,0,0,0,725070,0,0,0,725070,0,0,0,0,0,0,0,0,False,0,False,False,0,0,0
2023,00,PECOS COUNTY APPR DIST,18,00146-00017-09500-001460,1,1160,R,CALDERON JOE,,550 W 40TH LANE,,FT STOCKTON,TX,79735,8953,18M,00,01,31,63,66,,,MCP,,,,,False,550,40 LANE,W,FORT STOCKTON,TX,79735,,,,False,False,M1,,,,,0,,1.000000,0,0.00,H,,0,,,,,,,,0.0000,LOCATED    MOBILE HOME,PT-30,BLK 146     SEC 17,LITTLE MEXICO,,,,,,,0,0,0,0,0,0,0,0,0,0,24260,0,0,0,0,0,24260,11720,0,0,0,0,0,0,0,False,0,False,False,0,0,0
2023,00,PECOS COUNTY APPR DIST,20,00194-00003-01000-001506,1,26660,R,WEST OIL RESOURCES LLC,,106 DEEP LAKE DR,,LIBERTY HILL,TX,78642,,24M,00,01,32,63,65,,,MCP,,,,,False,,,,IRAAN,TX,79744,,,,False,False,E2,,,,,0,,1.000000,0,0.00,,,0,,,,,,,,0.0000,LOCATED        SHOP & M/H,BLK 194        SEC 3,,,,,,,,,0,0,0,0,0,0,0,0,0,0,0,0,88530,0,0,0,88530,88530,0,0,0,0,0,0,0,False,0,False,False,0,0,0
2023,00,PECOS COUNTY APPR DIST,31,00146-00017-01101-002075,1,2512,R,ESPARZA EDWARD,,4221 N JACKSON,,FT STOCKTON,TX,79735,9446,18M,00,01,31,63,66,,,MCP,,,,,False,4257,JACKSON,N,FORT STOCKTON,TX,79735,,,,False,False,M1,,,,,0,,1.000000,0,0.00,,,0,,,,,,,,0.0000,LOCATED    MOBILE HOME,3709        PT-2C,BLK 146     LITTLE MEXICO,SEC 17,,,,,,,0,0,0,0,0,0,0,0,0,0,0,0,35660,27100,0,0,62760,62760,0,0,0,0,0,0,0,False,0,False,False,0,0,0
2023,00,PECOS COUNTY APPR DIST,36,02120-03800-03000-002182,1,2695,R,FLORES ARMANDO R ETUX,,P O BOX 294,,SHEFFIELD,TX,79781,0294,24M,00,01,32,63,65,,,MCP,,,,,False,,PINE,,SHEFFIELD,TX,79781,,,,False,False,M1,,,,,0,,1.000000,0,0.00,,,0,,,,,,,,0.0000,LOCATED   MOBILE HOME,4,38,SHEFFIELD,,,,,,,0,0,0,0,0,0,0,0,0,0,0,0,7460,0,0,0,7460,7460,0,0,0,0,0,0,0,False,0,False,False,0,0,0
2023,00,PECOS COUNTY APPR DIST,38,01460-02100-04003-002206,1,4535,R,BARRAGAN DEBBIE ETVIR LINO,,661 MOCKINGBIRD LN,,FT STOCKTON,TX,79735,,16M,00,01,31,10,63,66,,MCP,,,,,False,689,MOCKINGBIRD,,FORT STOCKTON,TX,79735,,,,False,False,M1,,,,,0,,1.000000,0,0.00,,,0,,,,,,,,0.0000,LOCATED    MOBILE HOME,LOT 4,BLK 21,MESA VIEW,,,,,,,0,0,0,0,0,0,0,0,0,0,0,0,25100,0,0,0,25100,25100,0,0,0,0,0,0,0,False,0,False,False,0,0,0
2023,00,PECOS COUNTY APPR DIST,41,00117-00002-03900-02230,1,3053,R,GARCIA LARRY EST,,603 ARNETT,,FT STOCKTON,TX,79735,4725,18M,00,01,31,63,66,,,MCP,,,,,False,,,,FORT STOCKTON,TX,79735,,,,False,False,M1,,,,,0,,1.000000,0,0.00,,,0,,,,,,,,0.0000,LOCATED    MOBILE HOME,TR 20,W R CHANCELLOR,SEC 2,,,,,,,0,0,0,0,0,0,0,0,0,0,0,0,0,0,0,0,0,0,0,0,0,0,0,0,0,False,0,False,False,0,0,0
2023,00,PECOS COUNTY APPR DIST,53,00194-00003-01000-002376,1,3569,R,GRIGSBY RANDY,,P O BOX 235,,IRAAN,TX,79744,0235,24M,00,01,32,63,65,,,MCP,,,,,False,,FM 349,,IRAAN,TX,79744,,,,False,False,E2,,,,,0,,1.000000,0,0.00,H,,0,,,,,,,,0.0000,LOCATED MOBILE HOME,BLK 194   SEC 3,,,,,,,,,0,0,0,0,0,0,0,0,0,0,117980,0,0,0,0,0,117980,80420,0,0,0,0,0,0,0,False,0,False,False,0,0,0
2023,00,PECOS COUNTY APPR DIST,59,00018-00011-00100-002541,1,3778,R,HARTMAN RANDAL,,HCR 73 BOX 22,,MC CAMEY,TX,79752,9701,24M,00,01,32,63,65,,,MCP,,,,,False,,,,,,,,,,False,False,M1,,,,,0,,1.000000,0,0.00,H,,0,,,,,,,,0.0000,LOCATED  MOBILE HOME,BLK 18   UNIVERSITY LAND,SEC 11,,,,,,,,0,0,0,0,0,0,0,0,0,0,97060,0,0,0,0,0,97060,69430,0,0,0,0,0,0,0,False,0,False,False,0,0,0
2023,00,PECOS COUNTY APPR DIST,61,01600-26700-03000-002633,1,3865,R,HENDERSON MARVIN J,ETUX GRACE L,2038 E 51 ST LANE,,FT STOCKTON,TX,79735,9584,16M,00,01,31,10,63,66,,MCP,,,,,False,1506,WILLIAMS,N,FORT STOCKTON,TX,79735,,,,False,False,M1,,,,,0,,1.000000,0,0.00,,,0,,,,,,,,0.0000,LOCATED MOBILE HOME,LOT 3 BLK 267 ORIENT,,,,,,,,,0,0,0,0,0,0,0,0,0,0,12880,0,0,0,0,0,12880,12880,0,0,0,0,0,0,0,False,0,False,False,0,0,0
2023,00,PECOS COUNTY APPR DIST,74,00194-00002-00100-002972,1,4601,R,KIMBROUGH B D,LAVINE KIMBROUGH,P O BOX 752,,IRAAN,TX,79744,0752,24M,00,01,32,63,65,,,MCP,,,,,False,649,PRIVATE RD 8601,,IRAAN,TX,79744,,,,False,False,M1,,,,,0,,1.000000,0,0.00,H,,0,,,,,,,,0.0000,LOCATED        MOBILE HOME,BLK 194        SEC 2,,,,,,,,,0,0,0,0,0,0,0,0,0,0,170220,0,0,0,0,0,170220,90950,0,0,0,0,0,0,0,False,0,False,False,0,0,0
2023,00,PECOS COUNTY APPR DIST,87,00165-00001-01000-003373,1,5277,R,MAY DOUG,,P O BOX 250,,FT STOCKTON,TX,79735,0250,18M,00,01,31,63,66,,,MCP,,,,,False,,DAVIS,S,FORT STOCKTON,TX,79735,,,,False,False,M1,,,,,0,,1.000000,0,0.00,H,,0,,,,,,,,0.0000,LOCATED        MOBILE HOME,BLK 165        SEC 1,J CAMP,,,,,,,,0,0,0,0,0,0,0,0,0,0,40710,0,0,0,0,0,40710,33780,0,0,0,0,0,0,0,False,0,False,False,0,0,0
2023,00,PECOS COUNTY APPR DIST,89,00000-00000-03465-000000,1,5419,R,MC KENZIE LAND&LIVEST,LAZY 8 RANCH,HC 73   BOX 3,,MC CAMEY,TX,79752,,18M,00,01,31,63,66,,,MCP,,,,,False,,,,BAKERSFIELD,TX,,,,,False,False,M1,,,,,0,,1.000000,0,0.00,,,0,,,,,,,,0.0000,LOCATED        MOBILE HOME,BLK 21         SEC 21,UNIV LD,,,,,,,,0,0,0,0,0,0,0,0,0,0,0,0,12150,0,0,0,12150,12150,0,0,0,0,0,0,0,False,0,False,False,0,0,0
2023,00,PECOS COUNTY APPR DIST,95,00117-00003-39000-003671,1,3258,R,GOMEZ JERRY & ANNA,,P O BOX 602,,FT STOCKTON,TX,79735,0602,18M,00,01,31,63,66,,,MCP,,,,,False,2692,TRAVIS,S,FORT STOCKTON,TX,79735,,,,False,False,M1,,,,,0,,1.000000,0,0.00,,,0,,,,,,,,0.0000,LOCATED MOBILE HOME,TK 39,ALAMO,RANCH,,,,,,,0,0,0,0,0,0,0,0,0,0,0,0,109660,0,0,0,109660,109660,0,0,0,0,0,0,0,False,0,False,False,0,0,0
2023,00,PECOS COUNTY APPR DIST,96,01680-00100-01000-003700,1,29729,R,RIVAS JUAN,,PO BOX 712,,FORT STOCKTON,TX,79735,,16M,00,01,31,10,63,66,,MCP,,,,,False,735,US HWY 285,S,FORT STOCKTON,TX,79735,,,,False,False,M1,,,,,0,,1.000000,0,0.00,,,0,,,,,,,,0.0000,LOCATED MOBILE HOME,ROAD RUNNER RV PARK,SPOT # 116,SAN JACINTO,,,,,,,0,0,0,0,0,0,0,0,0,0,0,0,9720,470,0,0,10190,10190,0,0,0,0,0,0,0,False,0,False,False,0,0,0
2023,00,PECOS COUNTY APPR DIST,98,00001-08002-05100-003720,1,167,R,ALKA VIOLET,,1718 QUAIL RUN,,SAN MARCOS,TX,78666,9493,18M,00,01,31,63,66,,,MCP,,,,,False,,48 LANE,,FORT STOCKTON,TX,79735,,,,False,False,M1,,,,,0,,1.000000,0,0.00,,,0,,,,,,,,0.0000,LOCATED   MOBILE HOME,TR 51,BLK 1 FSIL SEC 2,,,,,,,,0,0,0,0,0,0,0,0,0,0,10480,0,0,0,0,0,10480,10480,0,0,0,0,0,0,0,False,0,False,False,0,0,0
2023,00,PECOS COUNTY APPR DIST,104,00001-08010-00900-003820,1,8111,R,SULLIVAN REBA N,ELAINE NEATHERLIN,16148 N DALE WADE AVE,,GARDENDALE,TX,79758,,18M,00,01,31,63,66,,,MCP,,,,,False,5160,SULLIVAN,N,FORT STOCKTON,TX,79735,,,,False,False,M1,,,,,0,,1.000000,0,0.00,,,0,,,,,,,,0.0000,LOCATED   MOBILE HOME,TK-8,BLK 1 FSIL,SEC 10,,,,,,,0,0,0,0,0,0,0,0,0,0,0,0,14770,0,0,0,14770,14770,0,0,0,0,0,0,0,False,0,False,False,0,0,0
2023,00,PECOS COUNTY APPR DIST,107,01460-00100-12000-003849,1,6121,R,ORTEGA ISRAEL ETUX,IRMA ORTEGA,1058 BLUEBIRD,,FT STOCKTON,TX,79735,,18M,00,01,31,63,66,,,MCP,,,,,False,1058,BLUEBIRD,,FORT STOCKTON,TX,79735,,,,False,False,M1,,,,,0,,1.000000,0,0.00,,,0,,,,,,,,0.0000,LOCATED   RESIDENCE,12   MILLVIEW,,,,,,,,,0,0,0,0,0,0,0,0,0,0,0,0,127300,0,0,0,127300,127300,0,0,0,0,0,0,0,False,0,False,False,0,0,0
2023,00,PECOS COUNTY APPR DIST,113,00001-08015-04300-003891,1,6208,R,PADILLA GERMAN,,1500 N ST GALL,,FT STOCKTON,TX,79735,2401,18M,00,01,31,63,66,,,MCP,,,,,False,,49 LANE,,FORT STOCKTON,TX,79735,,,,False,False,M1,,,,,0,,1.000000,0,0.00,H,,0,,,,,,,,0.0000,LOCATED  MOBILE HOME,E/2-43,BLK 1 FSIL,SEC 15,,,,,,,0,0,0,0,0,0,0,0,0,0,76150,98230,0,0,0,0,174380,154760,0,0,0,0,0,0,0,False,0,False,False,0,0,0
2023,00,PECOS COUNTY APPR DIST,116,00117-00003-14000-003897,1,6421,R,PERRY CAROL,,PO BOX 578,,FORT STOCKTON,TX,79735,0578,18M,00,01,31,63,66,,,MCP,,,,,False,2147,AUSTIN,S,FORT STOCKTON,TX,79735,,,,False,False,M1,,,,,0,,1.000000,0,0.00,,,0,,,,,,,,0.0000,LOCATED   MOBILE HOME,TK-14,ALAMO,RANCH,,,,,,,0,0,0,0,0,0,0,0,0,0,19400,0,0,0,0,0,19400,19400,0,0,0,0,0,0,0,False,0,False,False,0,0,0
2023,00,PECOS COUNTY APPR DIST,121,01680-00100-01000-004060,1,29777,R,ALMANZAR KAYLA,,735 S US HWY 285,,FORT STOCKTON,TX,79735,,16M,00,01,31,10,63,66,,MCP,,,,,False,735,US HWY 285,S,FORT STOCKTON,TX,79735,,,,False,False,M1,,,,,0,,1.000000,0,0.00,,,0,,,,,,,,0.0000,LOCATED MOBILE HOME,ROAD RUNNER RV PARK,SPOT #126,BRAZOS,,,,,,,0,0,0,0,0,0,0,0,0,0,0,0,6460,0,0,0,6460,6460,0,0,0,0,0,0,0,False,0,False,False,0,0,0
2023,00,PECOS COUNTY APPR DIST,127,00117-00003-13000-004151,1,6829,R,RAWLS DALE,LARRY LUJAN,PO BOX 28,,FORT STOCKTON,TX,79735,,18M,00,01,31,63,66,,,MCP,,,,,False,1307,ALAMO,W,FORT STOCKTON,TX,79735,,,,False,False,M1,,,,,0,,1.000000,0,0.00,,,0,,,,,,,,0.0000,LOCATED    MOBILE HOME,TR-13,ALAMO,RANCH,,,,,,,0,0,0,0,0,0,0,0,0,0,5140,0,0,0,0,0,5140,5140,0,0,0,0,0,0,0,False,0,False,False,0,0,0
2023,00,PECOS COUNTY APPR DIST,138,01180-00900-12000-004479,1,30557,R,KINGS BUILDERS & MANAGEMENT LLC,,4909 N STONE RD,,FORT STOCKTON,TX,79735,,16M,00,01,31,10,63,66,,MCP,,,,,False,1111,SCHLEGEL,N,FORT STOCKTON,TX,79735,,,,False,False,M1,,,,,0,,1.000000,0,0.00,,,0,,,,,,,,0.0000,LOCATED        MOBILE HOME,A&M MH PARK,LOT 12    SPACE 36,,,,,,,,0,0,0,0,0,0,0,0,0,0,26210,0,0,0,0,0,26210,26210,0,0,0,0,0,0,0,False,0,False,False,0,0,0
2023,00,PECOS COUNTY APPR DIST,150,01080-02600-31000-004840,1,15225,R,HERNANDEZ MONICO A,,P O BOX 794,,FT STOCKTON,TX,79735,0794,16M,00,01,31,10,63,66,,MCP,,,,,False,1405,SUNSET,N,FORT STOCKTON,TX,79735,,,,False,False,M1,,,,,0,,1.000000,0,0.00,H,,0,,,,,,,,0.0000,LOCATED  MOBILE HOME,"PT 1,2,3  BLK 26  BEVERLY SQ",SUNSET MH PARK,SEE MAP,,,,,,,0,0,0,0,0,0,0,0,0,0,20240,0,0,0,0,0,20240,13450,0,0,0,0,0,0,0,False,0,False,False,0,0,0
2023,00,PECOS COUNTY APPR DIST,153,00194-00002-00100-005038,1,8461,R,TUCKER NELSON,,P O BOX 482,,IRAAN,TX,79744,0482,24M,00,01,32,63,65,,,MCP,,,,,False,649,PRIVATE RD 8601,,IRAAN,TX,79744,,,,False,False,M1,,,,,0,,1.000000,0,0.00,H,,0,,,,,,,,0.0000,LOCATED  MOBILE HOME,BLK 194 SEC 2,,,,,,,,,0,0,0,0,0,0,0,0,0,0,45750,0,0,0,0,0,45750,29560,0,0,0,0,0,0,0,False,0,False,False,0,0,0
2023,00,PECOS COUNTY APPR DIST,154,00001-08006-02100-005045,1,8469,R,TURMAN H D,,603 W 47TH LANE,,FT STOCKTON,TX,79735,9526,18M,00,01,31,63,66,,,MCP,,,,,False,603,47 LANE,W,FORT STOCKTON,TX,79735,,,,False,False,M1,,,,,0,,1.000000,0,0.00,,,0,,,,,,,,0.0000,LOCATED        MOBILE HOME,FSIL,BLK 1       SEC 6 TR 21,,,,,,,,0,0,0,0,0,0,0,0,0,0,12570,0,0,0,0,0,12570,12570,0,0,0,0,0,0,0,False,0,False,False,0,0,0
2023,00,PECOS COUNTY APPR DIST,160,02100-01600-10000-005169,1,5226,R,MARTINEZ MANUEL,JOANNA BARRERA,PO BOX 1202,,IRAAN,TX,79744,,21M,00,01,32,12,63,65,,MCP,,,,,False,,FIFTH,,IRAAN,TX,79744,,,,False,False,M1,,,,,0,,1.000000,0,0.00,,,0,,,,,,,,0.0000,LOCATED    MOBILE HOME,LOT 10,BLK 16,IRRAN,,,,,,,0,0,0,0,0,0,0,0,0,0,20930,0,0,0,0,0,20930,20930,0,0,0,0,0,0,0,False,0,False,False,0,0,0
2023,00,PECOS COUNTY APPR DIST,163,00016-00022-00100-005431,1,24679,R,WOODWARD ERNEST RANCHES LTD,,HC 73 BOX 29,,MC CAMEY,TX,79752,,24M,00,01,32,63,65,,,MCP,,,,,False,,,,,,,,,,False,False,M1,,,,,0,,1.000000,0,0.00,,,0,,,,,,,,0.0000,LOCATED        MOBILE HOME,BLK 16         SEC 22,UNV LD,,,,,,,,0,0,0,0,0,0,0,0,0,0,0,0,63580,0,0,0,63580,63580,0,0,0,0,0,0,0,False,0,False,False,0,0,0
2023,00,PECOS COUNTY APPR DIST,166,02100-00200-09000-005462,1,7447,R,RICO JUAN,,P O BOX 521,,IRAAN,TX,79744,0521,21M,00,01,32,12,63,65,,MCP,,,,,False,306,SEVENTH,,IRAAN,TX,79744,,,,False,False,M1,,,,,0,,1.000000,0,0.00,,,0,,,,,,,,0.0000,LOCATED MOBILE HOME,SPT -9,BLK 2,IRAAN,,,,,,,0,0,0,0,0,0,0,0,0,0,0,0,11550,0,0,0,11550,11550,0,0,0,0,0,0,0,False,0,False,False,0,0,0
2023,00,PECOS COUNTY APPR DIST,169,01460-01700-11000-009402,1,17975,R,ORTEGA RUPERTO,,1397 KILDEER LN,,FORT STOCKTON,TX,79735,9443,18M,00,01,31,63,66,,,MCP,,,,,False,1397,KILLDEER,,FORT STOCKTON,TX,79735,,,,False,False,A1,,,,,0,,1.000000,0,0.00,H,,0,,,,,,,,0.0000,LOCATED  RES ONLY,W 200f-11,BLK 17,MESA VIEW,,,,,,,0,0,0,0,0,0,0,0,0,0,163000,0,0,0,0,0,163000,76370,0,0,0,0,0,0,0,False,0,False,False,0,0,0
2023,00,PECOS COUNTY APPR DIST,173,00146-00017-02700-009408,1,1311,R,CARRILLO OSCAR,,P O BOX 1755,,FT STOCKTON,TX,79735,1755,18M,00,01,31,63,66,,,MCP,,,,,False,798,40 LANE,,FORT STOCKTON,TX,79735,,,,False,False,M1,,,,,0,,1.000000,0,0.00,H,,0,,,,,,,,0.0000,LOCATED        MOBILE HOME,NPT-27,BLK 146,SEC 17     LITTLE MEXICO,,,,,,,0,0,0,0,0,0,0,0,0,0,9200,106090,0,0,0,0,115290,115280,0,0,0,0,0,0,0,False,0,False,False,0,0,0
2023,00,PECOS COUNTY APPR DIST,174,00146-00017-02800-009409,1,6605,R,PRIMERA PAT,NOEMI PRIMERA,4027 N WATER ST,,FT STOCKTON,TX,79735,2115,18M,00,01,31,63,66,,,MCP,,,,,False,,40 LANE,,FORT STOCKTON,TX,79735,,,,False,False,M1,,,,,0,,1.000000,0,0.00,,,0,,,,,,,,0.0000,LOCATED    MOBILE HOME,NPT 28B,BLK 146,SEC 17     LITTLE MEXICO,,,,,,,0,0,0,0,0,0,0,0,0,0,0,0,28780,0,0,0,28780,28780,0,0,0,0,0,0,0,False,0,False,False,0,0,0
2023,00,PECOS COUNTY APPR DIST,179,00146-00017-07000-009419,1,26,R,ACOSTA JAMIE & LAZARO S,,624 WEST 42ND LANE,,FT STOCKTON,TX,79735,8960,18M,00,01,31,63,66,,,MCP,,,,,False,600,42 LANE,W,FORT STOCKTON,TX,79735,,,,False,False,M1,,,,,0,,1.000000,0,0.00,,,0,,,,,,,,0.0000,LOCATED   MOBILE HOME,NE COR-7,BLK 146,SEC 17     LITTLE MEXICO,,,,,,,0,0,0,0,0,0,0,0,0,0,3870,0,0,0,0,0,3870,3870,0,0,0,0,0,0,0,False,0,False,False,0,0,0
2023,00,PECOS COUNTY APPR DIST,183,01680-00100-01000-009426,1,29683,R,ELKINS ROBERT WAYNE,,PO BOX 1091,,FORT STOCKTON,TX,79735,,16M,00,01,31,10,63,66,,MCP,,,,,False,735,US HWY 285,S,FORT STOCKTON,TX,79735,,,,False,False,M1,,,,,0,,1.000000,0,0.00,H,,0,,,,,,,,0.0000,LOCATED MOBILE HOME,ROAD RUNNER RV PARK,SPOT #26,JOSHUA,,,,,,,0,0,0,0,0,0,0,0,0,0,41750,0,0,0,0,0,41750,30500,0,0,0,0,0,0,0,False,0,False,False,0,0,0
2023,00,PECOS COUNTY APPR DIST,184,01680-00100-01000-009429,1,29721,R,BRADFORD TAELOR,,735 S US HWY 285,,FORT STOCKTON,TX,79735,,16M,00,01,31,10,63,66,,MCP,,,,,False,735,US HWY 285,S,FORT STOCKTON,TX,79735,,,,False,False,M1,,,,,0,,1.000000,0,0.00,,,0,,,,,,,,0.0000,LOCATED MOBILE HOME,ROAD RUNNER RV PARK,SPOT #23,JOSHUA,,,,,,,0,0,0,0,0,0,0,0,0,0,0,0,7870,0,0,0,7870,7870,0,0,0,0,0,0,0,False,0,False,False,0,0,0
2023,00,PECOS COUNTY APPR DIST,186,02100-00200-09000-009438,1,6976,R,RICO JUAN ETUX MARIA,,P O BOX 521,,IRAAN,TX,79744,0521,21M,00,01,32,12,63,65,,MCP,,,,,False,,SEVENTH,,IRAAN,TX,79744,,,,False,False,M1,,,,,0,,1.000000,0,0.00,,,0,,,,,,,,0.0000,LOCATED        MOBILE HOME,NPT-9          BLK 2,IRAAN,,,,,,,,0,0,0,0,0,0,0,0,0,0,0,0,1380,0,0,0,1380,1380,0,0,0,0,0,0,0,False,0,False,False,0,0,0
2023,00,PECOS COUNTY APPR DIST,191,00194-00069-00100-009448,1,28344,R,SCHNEEMANN STEPHEN CADE,,P O BOX 523,,IRAAN,TX,79744,,24M,00,01,32,63,65,,,MCP,,,,,False,7420,CO-OP RD,,,,,,,,False,False,M1,,,,,0,,1.000000,0,0.00,,,0,,,,,,,,0.0000,LOCATED        MOBILE HOME,BLK 194     SEC 69,,,,,,,,,0,0,0,0,0,0,0,0,0,0,117390,0,0,0,0,0,117390,117390,0,0,0,0,0,0,0,False,0,False,False,0,0,0
2023,00,PECOS COUNTY APPR DIST,192,02120-03900-03000-009450,1,3455,R,GRAHAM JOHN ALLEN,,P O BOX 427,,SHEFFIELD,TX,79781,0427,11M,00,01,13,32,63,65,,MCP,,,,,False,,AVE I,,SHEFFIELD,TX,79781,,,,False,False,M1,,,,,0,,1.000000,0,0.00,H,,0,,,,,,,,0.0000,LOCATED   MOBILE HOME,3 & 4,BLK 39,SHEFFIELD,,,,,,,0,0,0,0,0,0,0,0,0,0,81900,0,0,0,0,0,81900,63180,0,0,0,0,0,0,0,False,0,False,False,0,0,0
2023,00,PECOS COUNTY APPR DIST,197,00000-00318-01600-009506,1,4245,R,IBARRA CARLOS,,4006 N STATE ST,,FT STOCKTON,TX,79735,,18M,00,01,31,63,66,,,MCP,,,,,False,351,SMITH,E,FORT STOCKTON,TX,79735,,,,False,False,M1,,,,,0,,1.000000,0,0.00,,,0,,,,,,,,0.0000,LOCATED    MOBILE HOME,16   C       BODIE TOWN,,,,,,,,,0,0,0,0,0,0,0,0,0,0,0,0,2650,0,0,0,2650,2650,0,0,0,0,0,0,0,False,0,False,False,0,0,0
2023,00,PECOS COUNTY APPR DIST,213,01680-00100-01000-009531,1,31125,R,VAQUERO HOMES LLC,,1400 BELLEVILLE STREET,,RICHMOND,VA,23230,,16M,00,01,31,10,63,66,,MCP,,,,,False,735,US HWY 285,S,FORT STOCKTON,TX,79735,,,,False,False,M1,,,,,0,,1.000000,0,0.00,,,0,,,,,,,,0.0000,LOCATED MOBILE HOME,ROAD RUNNER RV PARK,SPOT #33,JOSHUA,,,,,,,0,0,0,0,0,0,0,0,0,0,0,0,5580,0,0,0,5580,5580,0,0,0,0,0,0,0,False,0,False,False,0,0,0
2023,00,PECOS COUNTY APPR DIST,217,00000-00000-09537-000000,1,5617,R,MILLER SAM,FREDDY PIERCE,P O BOX 1389,,**UNKNOWN***,,,,18M,00,01,31,63,66,,,MCP,,,,,False,,MENDEL,,FORT STOCKTON,TX,79735,,,,False,False,M1,,,,,0,,1.000000,0,0.00,,,0,,,,,,,,0.0000,LOCATED        MOBILE HOMES,48-9           T&P,SEC 30,,,,,,,,0,0,0,0,0,0,0,0,0,0,0,0,2610,0,0,0,2610,2610,0,0,0,0,0,0,0,False,0,False,False,0,0,0
2023,00,PECOS COUNTY APPR DIST,218,00135-00026-01000-009538,1,4604,R,KINCAID T C JR,,P O BOX 1371,,FT STOCKTON,TX,79735,,18M,00,01,31,63,66,,,MCP,,,,,False,,,,,,,,,,False,False,M1,,,,,0,,1.000000,0,0.00,,,0,,,,,,,,0.0000,LOCATED        MOBILE HOME,BLK 135       SEC 26,,,,,,,,,0,0,0,0,0,0,0,0,0,0,0,0,7550,0,0,0,7550,7550,0,0,0,0,0,0,0,False,0,False,False,0,0,0
2023,00,PECOS COUNTY APPR DIST,222,00194-00074-00100-009545,1,3845,R,HEINEN ELLEN L,,P O BOX 3532,,MIDLAND,TX,79702,3532,24M,00,01,32,63,65,,,MCP,,,,,False,1212,HWY 1901,,,,,,,,False,False,M1,,,,,0,,1.000000,0,0.00,,,0,,,,,,,,0.0000,LOCATED MOBILE HOME,5350  194  GC&SF  SEC 74,,,,,,,,,0,0,0,0,0,0,0,0,0,0,22380,1120,0,0,0,0,23500,23500,0,0,0,0,0,0,0,False,0,False,False,0,0,0
2023,00,PECOS COUNTY APPR DIST,225,02100-00300-08000-009549,1,5764,R,MORALES SANTOS,,P O BOX 704,,IRAAN,TX,79744,0704,21M,00,01,32,12,63,65,,MCP,,,,,False,204B,SEVENTH,W,IRAAN,TX,79744,,,,False,False,M1,,,,,0,,1.000000,0,0.00,,,0,,,,,,,,0.0000,LOCATED        MOBILE HOME,NPT-8,BLK 3,IRAAN,,,,,,,0,0,0,0,0,0,0,0,0,0,0,0,3410,0,0,0,3410,3410,0,0,0,0,0,0,0,False,0,False,False,0,0,0
2023,00,PECOS COUNTY APPR DIST,227,02100-00700-01000-009551,1,8460,R,STEPHENS LANELLE,,P O BOX 643,,IRAAN,TX,79744,0643,21M,00,01,32,12,63,65,,MCP,,,,,False,306,EIGHTH,,IRAAN,TX,79744,,,,False,False,M1,,,,,0,,1.000000,0,0.00,H,,0,,,,,,,,0.0000,LOCATED        MOBILE HOME,S/PT 2-5     SP 1,BLK 7,IRAAN,,,,,,,0,0,0,0,0,0,0,0,0,0,39310,0,0,0,0,0,39310,28460,0,0,0,0,0,0,0,False,0,False,False,0,0,0
2023,00,PECOS COUNTY APPR DIST,230,02131-01000-20000-009559,1,27893,R,CARSON CHRIS,,PO BOX 156,,LENORAH,TX,79749,0156,11M,00,01,13,32,63,65,,MCP,,,,,False,,LOUISIANA,,SHEFFIELD,TX,79781,,,,False,False,M1,,,,,0,,1.000000,0,0.00,,,0,,,,,,,,0.0000,LOCATED   MOBILE HOME,LOT 17-20,BLK 10,AUTERY,,,,,,,0,0,0,0,0,0,0,0,0,0,0,0,30030,0,0,0,30030,30030,0,0,0,0,0,0,0,False,0,False,False,0,0,0
2023,00,PECOS COUNTY APPR DIST,240,00001-08002-03700-009576,1,2534,R,ESPINO MARISA,,P O BOX 333,,FT STOCKTON,TX,79735,0333,18M,00,01,31,63,66,,,MCP,,,,,False,1755,49 LANE,W,FORT STOCKTON,TX,79735,,,,False,False,M1,,,,,0,,1.000000,0,0.00,H,,0,,,,,,,,0.0000,LOCATED   MOBILE HOME,PT 37,BLK 1 FSIL SEC 2,,,,,,,,0,0,0,0,0,0,0,0,0,0,33620,0,0,0,0,0,33620,22540,0,0,0,0,0,0,0,False,0,False,False,0,0,0
2023,00,PECOS COUNTY APPR DIST,249,00194-00086-00100-009604,1,4230,R,HUNTERS ASSOCIATION,"ROBERT LEMENS,TTEE FOR TACT",JOHN MADDOX,P O BOX 9841,**UNKNOWN**,,,,24M,00,01,32,63,65,,,MCP,,,,,False,,I-10,,,,,,,,False,False,M1,,,,,0,,1.000000,0,0.00,,,0,,,,,,,,0.0000,LOCATED        MOBILE HOME,BLK 194        SEC 86,,,,,,,,,0,0,0,0,0,0,0,0,0,0,0,0,5380,0,0,0,5380,5380,0,0,0,0,0,0,0,False,0,False,False,0,0,0
2023,00,PECOS COUNTY APPR DIST,268,00001-08006-04900-009629,1,26635,R,KIPGEN VICTOR P III,,205 W 45TH LANE,,FORT STOCKTON,TX,79735,,18M,00,01,31,63,66,,,MCP,,,,,False,205,45 LANE,E,FORT STOCKTON,TX,79735,,,,False,False,M1,,,,,0,,1.000000,0,0.00,H,,0,,,,,,,,0.0000,LOCATED        MOBILE HOME,PT 49          BLK 1,FSIL           SEC 6,,,,,,,,0,0,0,0,0,0,0,0,0,0,10730,0,0,0,0,0,10730,8250,0,0,0,0,0,0,0,False,0,False,False,0,0,0
2023,00,PECOS COUNTY APPR DIST,269,00001-08001-01400-009630,1,15943,R,SOTO ADAN,,1478 W 46TH ST,,FT STOCKTON,TX,79735,9511,18M,00,01,31,63,66,,,MCP,,,,,False,1504,46 LANE,W,FORT STOCKTON,TX,79735,,,,False,False,M1,,,,,0,,1.000000,0,0.00,,,0,,,,,,,,0.0000,LOCATED        MOBILE HOME,E/2W/2,TK 14       BLK 1 FSIL SEC 1,,,,,,,,0,0,0,0,0,0,0,0,0,0,0,0,14460,0,0,0,14460,14460,0,0,0,0,0,0,0,False,0,False,False,0,0,0
2023,00,PECOS COUNTY APPR DIST,275,00117-00003-34000-009640,1,3395,R,LECHLER  HILDA,,2062  S TRAVIS,,FT STOCKTON,TX,79735,8992,18M,00,01,31,63,66,,,MCP,,,,,False,2022,TRAVIS,S,FORT STOCKTON,TX,79735,,,,False,False,M1,,,,,0,,1.000000,0,0.00,H,,0,,,,,,,,0.0000,LOCATED    MOBILE HOME,NW COR -34,ALAMO,RANCH,,,,,,,0,0,0,0,0,0,0,0,0,0,52200,0,0,0,0,0,52200,36250,0,0,0,0,0,0,0,False,0,False,False,0,0,0