Year,Jurisdiction,Jur_Name,Parcel_ID,Account,Ownership_Sequence,Owner_Id,Owner_Prefix,Name,Careof,Street,Street_Overflow,City,State,Zip5,Zip4,Location_Code,Jur 1,Jur 2,Jur 3,Jur 4,Jur 5,Jur 6,Jur 7,Jur 8,Jur 9,Jur 10,Jur 11,Jur 12,Is_Exempt,Prop_Street_Number,Prop_Street,Prop_Street_Dir,Prop_City,Prop_State,Prop_Zip5,Prop_Zip4,Map1,Map2,Is_Protested,Has_Hs_Link,Primary_Category_Code,Secondary_Category_Code,Third_Category_Code,DBA,Interest,Ceiling_Year,Ceiling_Tax,Homestead_Code,Agent_Code,Agent_Name,Acres,Legal1,Legal2,Legal3,Legal4,Mortgage_Code,Lease_Number,Lease_Name,Operator_Name,RRC_Number,Interest_Type,Land_Hs,Land_Nhs,Land_Productivity_Market,Land_1d1,Land_1d,Land_Timber,Personal_Hs,Personal_Nhs,Market_Value,Net_Taxable_Value,State_Homestead,State_Mandated_Over65,State_Mandated_Disabled,Optional65,Local_Disabled,Road_Homestead,Disabled_Veteran,New_Personal_Hs,New_Personal_Nhs,Improvement_Hs,New_Improvement_Hs,Improvement_Nhs,New_Improvement_Nhs,Is_Owner_Confidential,Local_Discount,Has_Abatement,Has_Miscellaneous_Exemption,Abatement_Value,Mineral_Freeport_Value,Mineral_Unknown_Value
2021,00,PECOS COUNTY APPR DIST,14,00008-00017-01000-001339,1,893,R,BRADEN KELLEY,ALVIN BRADEN,P O BOX 127,,COYANOSA,TX,79730,0127,12M,00,01,30,63,,,,MCP,,,,,False,,HWY 1450,,COYANOSA,TX,79730,,,,False,False,M1,,,,1.000000,0,0.00,H,,,0.0000,LOCATED        MOBILE HOME,BLK 8   H&GN  SEC 17,,,,,,,,,0,0,0,0,0,0,0,0,27380,24420,0,0,0,0,0,0,0,0,0,27380,0,0,0,False,0,False,False,0,0,0
2021,00,PECOS COUNTY APPR DIST,95,00117-00003-39000-003671,1,3258,R,GOMEZ JERRY & ANNA,,P O BOX 602,,FT STOCKTON,TX,79735,0602,18M,00,01,31,63,,,,MCP,,,,,False,2692,TRAVIS,S,FORT STOCKTON,TX,79735,,,,False,False,M1,,,,1.000000,0,0.00,,,,0.0000,LOCATED MOBILE HOME,TK 39,ALAMO,RANCH,,,,,,,0,0,0,0,0,0,0,0,81810,81810,0,0,0,0,0,0,0,0,0,0,0,81810,0,False,0,False,False,0,0,0
2021,00,PECOS COUNTY APPR DIST,127,00117-00003-13000-004151,1,6829,R,RAWLS DALE,LARRY LUJAN,PO BOX 28,,FORT STOCKTON,TX,79735,,18M,00,01,31,63,,,,MCP,,,,,False,1307,ALAMO,W,FORT STOCKTON,TX,79735,,,,False,False,M1,,,,1.000000,0,0.00,,,,0.0000,LOCATED    MOBILE HOME,TR-13,ALAMO,RANCH,,,,,,,0,0,0,0,0,0,0,0,4640,4640,0,0,0,0,0,0,0,0,0,4640,0,0,0,False,0,False,False,0,0,0
2021,00,PECOS COUNTY APPR DIST,160,02100-01600-10000-005169,1,5226,R,MARTINEZ MANUEL,JOANNA BARRERA,PO BOX 1202,,IRAAN,TX,79744,,21M,00,01,32,12,63,65,,MCP,,,,,False,,FIFTH,,IRAAN,TX,79744,,,,False,False,M1,,,,1.000000,0,0.00,,,,0.0000,LOCATED    MOBILE HOME,LOT 10,BLK 16,IRRAN,,,,,,,0,0,0,0,0,0,0,0,12830,12830,0,0,0,0,0,0,0,0,0,12830,0,0,0,False,0,False,False,0,0,0
2021,00,PECOS COUNTY APPR DIST,166,02100-00200-09000-005462,1,7447,R,RICO JUAN,,P O BOX 521,,IRAAN,TX,79744,0521,21M,00,01,32,12,63,65,,MCP,,,,,False,307,SEVENTH,,IRAAN,TX,79744,,,,False,False,M1,,,,1.000000,0,0.00,,,,0.0000,LOCATED MOBILE HOME,SPT -9,BLK 2,IRAAN,,,,,,,0,0,0,0,0,0,0,0,6940,6940,0,0,0,0,0,0,0,0,0,0,0,6940,0,False,0,False,False,0,0,0
2021,00,PECOS COUNTY APPR DIST,191,00194-00069-00100-009448,1,28344,R,SCHNEEMANN STEPHEN CADE,,P O BOX 523,,IRAAN,TX,79744,,24M,00,01,32,63,65,,,MCP,,,,,False,7420,CO-OP RD,,,,,,,,False,False,M1,,,,1.000000,0,0.00,,,,0.0000,LOCATED        MOBILE HOME,BLK 194     SEC 69,,,,,,,,,0,0,0,0,0,0,0,0,86210,86210,0,0,0,0,0,0,0,0,0,86210,0,0,0,False,0,False,False,0,0,0
2021,00,PECOS COUNTY APPR DIST,338,01680-00100-01000-009742,1,27549,R,PARKVIEW MHP REAL ESTATE LLC,,5773 WOODWAY DR #37,,HOUSTON,TX,77057,,16M,00,01,31,10,63,,,MCP,,,,,False,735,US HWY 285,S,FORT STOCKTON,TX,79735,,,,False,False,M1,,,,1.000000,0,0.00,,,,0.0000,LOCATED MOBILE HOME,ROAD RUNNER RV PARK,SPOT # 124,BRAZOS,,,,,,,0,0,0,0,0,0,0,0,4810,4810,0,0,0,0,0,0,0,0,0,0,0,4810,0,False,0,False,False,0,0,0
2021,00,PECOS COUNTY APPR DIST,431,00000-00008-50232-000000,1,1684,R,GALLEGOS LLC,DBA COMANCHE TORTILLA AND TAMALES,BEN GALLEGOS JR,107 S NELSON,FT STOCKTON,TX,79735,,16M,00,01,31,10,63,,,MCP,,,,,False,107,NELSON,S,FORT STOCKTON,TX,79735,,,,False,False,L1,,,,1.000000,0,0.00,,,,0.0000,"INV, FURN & EQUIP",,,,,,,,,,0,0,0,0,0,0,0,2150,2150,2150,0,0,0,0,0,0,0,0,0,0,0,0,0,False,0,False,False,0,0,0
2021,00,PECOS COUNTY APPR DIST,440,00000-00008-50320-000000,1,2402,R,EAGLES LODGE #3220,,P O BOX 185,,FT STOCKTON,TX,79735,,16M,00,01,31,10,63,,,MCP,,,,,True,1401,DICKINSON,E,FORT STOCKTON,TX,79735,,,,False,False,XV,,,,1.000000,0,0.00,,,,0.0000,INVENTORY,MACH & EQUIP,,,,,,,,,0,0,0,0,0,0,0,1580,1580,0,0,0,0,0,0,0,0,0,0,0,0,0,0,False,0,False,False,0,0,0
2021,00,PECOS COUNTY APPR DIST,446,00000-00008-50342-000000,1,2482,R,ELVINS AUTO REPAIR,NITA HENDERSON,1407 N PECOS,,FT STOCKTON,TX,79735,3329,16M,00,01,31,10,63,,,MCP,,,,,False,1508,WILLIAMS,N,FORT STOCKTON,TX,79735,,,,False,False,L1,,,,1.000000,0,0.00,,,,0.0000,INVENTORY & EQUIPMENT,MACH & VEHICLE,,,,,,,,,0,0,0,0,0,0,0,6090,6090,6090,0,0,0,0,0,0,0,0,0,0,0,0,0,False,0,False,False,0,0,0
2021,00,PECOS COUNTY APPR DIST,511,00000-00008-50739-000000,1,5075,R,M & H LEASING CO INC,PAULETTE HINKLE,P O BOX 502,,PAMPA,TX,79066,0502,08M,00,01,12,32,63,65,,MCP,,,,,False,120,SIXTH,,IRAAN,TX,79744,,,,False,False,L1,,,,1.000000,0,0.00,,,,0.0000,EQUIPMENT,,,,,,,,,,0,0,0,0,0,0,0,5850,5850,5850,0,0,0,0,0,0,0,0,0,0,0,0,0,False,0,False,False,0,0,0
2021,00,PECOS COUNTY APPR DIST,630,00000-00009-02032-000000,1,5324,R,MC COY CORP STORE #087,HARDING & CARBONE,1235 NORTH LOOP WEST   STE 205,,HOUSTON,TX,77008,,16M,00,01,31,10,63,,,MCP,,,,,False,1300,HWY 285,N,FORT STOCKTON,TX,79735,,,,False,False,L1,,,,1.000000,0,0.00,,,,0.0000,"INV,FIX,EQUIP",,,,,,,,,,0,0,0,0,0,0,0,849220,849220,849220,0,0,0,0,0,0,0,0,0,0,0,0,0,False,0,False,False,0,0,0
2021,00,PECOS COUNTY APPR DIST,733,00000-00009-43052-000000,1,3412,R,GONZALEZ BOOKKEEPING,,203 S NELSON,,FT STOCKTON,TX,79735,,16M,00,01,31,10,63,,,MCP,,,,,False,203,NELSON,S,FORT STOCKTON,TX,79735,,,,False,False,L1,,,,1.000000,0,0.00,,,,0.0000,"FF&E,INV",,,,,,,,,,0,0,0,0,0,0,0,1000,1000,1000,0,0,0,0,0,0,0,0,0,0,0,0,0,False,0,False,False,0,0,0
2021,00,PECOS COUNTY APPR DIST,750,00000-00009-43100-000000,1,6225,R,PAISANO BONDING,ADELINA T SALAZAR,P O BOX 784,,FT STOCKTON,TX,79735,0784,16M,00,01,31,10,63,,,MCP,,,,,False,301,CALLAGHAN,W,FORT STOCKTON,TX,79735,,,,False,False,L1,,,,1.000000,0,0.00,,,,0.0000,"FF&E,INV",,,,,,,,,,0,0,0,0,0,0,0,500,500,500,0,0,0,0,0,0,0,0,0,0,0,0,0,False,0,False,False,0,0,0
2021,00,PECOS COUNTY APPR DIST,765,00000-00009-43121-000000,1,7892,R,SOUTHWEST SECURITY SYS,RUBEN CARRASCO,P O BOX 281,,BALMORHEA,TX,79718,0281,16M,00,01,31,10,63,,,MCP,,,,,False,,,,,,,,,,False,False,L1,,,,1.000000,0,0.00,,,,0.0000,EQUIPMENT,,,,,,,,,,0,0,0,0,0,0,0,1800,1800,1800,0,0,0,0,0,0,0,0,0,0,0,0,0,False,0,False,False,0,0,0
2021,00,PECOS COUNTY APPR DIST,773,00000-00009-43135-000000,1,8409,R,TRANS PECOS PLANTS,BRENT OR LISA SIEGMUND,804-B SYCAMORE STREET,,FT STOCKTON,TX,79735,4603,18M,00,01,31,63,,,,MCP,,,,,False,804B,SYCAMORE,S,FORT STOCKTON,TX,79735,,,,False,False,L1,,,,1.000000,0,0.00,,,,0.0000,FF&E,,,,,,,,,,0,0,0,0,0,0,0,14210,14210,14210,0,0,0,0,0,0,0,0,0,0,0,0,0,False,0,False,False,0,0,0
2021,00,PECOS COUNTY APPR DIST,786,00000-00009-50150-000000,1,27592,R,JULIES EZ PRESS CLEANERS,JULIE IBARRA,P O BOX 459,,FT STOCKTON,TX,79735,,16M,00,01,31,10,63,,,MCP,,,,,False,1101,FRONT,N,FORT STOCKTON,TX,79735,,,,False,False,L1,,,,1.000000,0,0.00,,,,0.0000,FF&E,,,,,,,,,,0,0,0,0,0,0,0,45600,45600,45600,0,0,0,0,0,0,0,0,0,0,0,0,0,False,0,False,False,0,0,0
2021,00,PECOS COUNTY APPR DIST,974,00000-00050-00900-000000,1,26630,R,BESS INVESTMENTS LP,,13619 INWOOD RD,SUITE 320,FARMERS BRANCH,TX,75244,,18M,00,01,31,63,,,,MCP,,,,,False,,,,,,,,,,False,False,D1,,,,0.633332,0,0.00,,,,82.0165,2150     B NOBLE SEC 50   TK 1,UND INT,,,,,,,,,0,0,6890,760,0,0,0,0,6890,760,0,0,0,0,0,0,0,0,0,0,0,0,0,False,0,False,False,0,0,0
2021,00,PECOS COUNTY APPR DIST,978,00000-00050-01200-000000,1,27324,R,W T BYLER HOLDINGS COMPANY LP,,15203 LILLJA ROAD,,HOUSTON,TX,77060,,18M,00,01,31,63,,,,MCP,,,,,False,,HWY 385,,FORT STOCKTON,TX,79735,,,,False,False,D1,,,,0.182288,0,0.00,,,,70.8189,2150    B NOBLE SEC 50   E/2,UND INT,,,,,,,,,0,0,6540,900,0,0,0,0,6540,900,0,0,0,0,0,0,0,0,0,0,0,0,0,False,0,False,False,0,0,0
2021,00,PECOS COUNTY APPR DIST,988,00000-00100-00100-000000,1,15074,R,COX CHARLES FOSTER,PATRICIA H,P O BOX 507,,FT STOCKTON,TX,79735,0507,18M,00,01,31,63,,,,MCP,,,,,False,,,,,,,,,,False,False,D1,,,,1.000000,0,0.00,,,,4605.0000,2006        T J HALL 100,,,,,,,,,,0,0,430080,47440,0,0,0,0,430080,47440,0,0,0,0,0,0,0,0,0,0,0,0,0,False,0,False,False,0,0,0
2021,00,PECOS COUNTY APPR DIST,996,00000-00207-00200-000000,1,25232,R,THE POLLY L BROOKS TRUST,CHIP LOVE TRUSTEE,P O BOX 1323,,MARFA,TX,79843,,18M,00,01,31,63,,,,MCP,,,,,False,,,,,,,,,,False,False,D1,,,,1.000000,0,0.00,,,,751.4000,4848        D WEST,SEC 207 1/2,,,,,,,,,0,0,77170,10770,0,0,0,0,77170,10770,0,0,0,0,0,0,0,0,0,0,0,0,0,False,0,False,False,0,0,0
2021,00,PECOS COUNTY APPR DIST,997,00000-00208-00100-000000,1,25232,R,THE POLLY L BROOKS TRUST,CHIP LOVE TRUSTEE,P O BOX 1323,,MARFA,TX,79843,,18M,00,01,31,63,,,,MCP,,,,,False,,,,,,,,,,False,False,D1,,,,1.000000,0,0.00,,,,1279.8700,5        J BURLESON,SEC 208,,,,,,,,,0,0,135980,16210,0,0,0,0,135980,16210,0,0,0,0,0,0,0,0,0,0,0,0,0,False,0,False,False,0,0,0
2021,00,PECOS COUNTY APPR DIST,1000,00000-00213-00100-000000,1,25232,R,THE POLLY L BROOKS TRUST,CHIP LOVE TRUSTEE,P O BOX 1323,,MARFA,TX,79843,,18M,00,01,31,63,,,,MCP,,,,,False,,,,,,,,,,False,False,D1,,,,1.000000,0,0.00,,,,640.0000,739        T JAMES SEC 213,,,,,,,,,,0,0,52320,5350,0,0,0,0,52320,5350,0,0,0,0,0,0,0,0,0,0,0,0,0,False,0,False,False,0,0,0
2021,00,PECOS COUNTY APPR DIST,1027,00000-00216-01900-000000,1,653,R,TEMPLO AGUA VIVA-E.QUINTELLA,C/S ERNESTINA BERNAL,503 N MISSOURI,,FT STOCKTON,TX,79735,,18M,00,01,31,63,,,,MCP,,,,,True,,HWY 285,,FORT STOCKTON,TX,79735,,,,False,False,XV,,,,1.000000,0,0.00,,,,0.5400,53        J H HERNDON,SEC 216,,,,,,,,,0,730,0,0,0,0,0,0,51150,0,0,0,0,0,0,0,0,0,0,0,0,50420,0,False,0,False,False,0,0,0
2021,00,PECOS COUNTY APPR DIST,1042,00000-00311-00400-000000,1,15261,R,BLANKENSHIP JERRY  & ETUX,BETIE,305 MONTWOOD,,SEGUIN,TX,78155,1219,18M,00,01,31,63,,,,MCP,,,,,False,,,,,,,,,,False,False,E,,,,1.000000,0,0.00,,,,19.0400,756  O LEON SPRINGS,SEC 311,,,,,,,,,0,1870,0,0,0,0,0,0,1870,1870,0,0,0,0,0,0,0,0,0,0,0,0,0,False,0,False,False,0,0,0
2021,00,PECOS COUNTY APPR DIST,1067,00000-00318-02100-000000,1,15648,R,JAQUEZ FRANCISCO & VILMA,,807 W GALLAGHER,,FT STOCKTON,TX,79735,7405,18M,00,01,31,63,,,,MCP,,,,,False,216,BISHOP,,FORT STOCKTON,TX,79735,,,,False,False,A1,,,,1.000000,0,0.00,,,,0.3300,1371        SA&MG SEC 318,TR 14       BODIE TOWN,,,,,,,,,500,0,0,0,0,0,0,0,36330,36330,0,0,0,0,0,0,0,0,0,35830,0,0,0,False,0,False,False,0,0,0
2021,00,PECOS COUNTY APPR DIST,1080,00000-00318-03100-000000,1,26266,R,CERVANTES JOSE REYNALDO R,,1400 N RIO,,FT STOCKTON,TX,79735,,18M,00,01,31,63,,,,MCP,,,,,False,135,SMITH ST,E,FORT STOCKTON,TX,79735,,,,False,False,F1,,,,1.000000,0,0.00,,,,0.9900,1371        SA&MG SEC 318,TR -20     BODIE TOWN,,,,,,,,,0,2480,0,0,0,0,0,0,64900,64900,0,0,0,0,0,0,0,0,0,0,0,62420,0,False,0,False,False,0,0,0
2021,00,PECOS COUNTY APPR DIST,1081,00000-00318-03200-000000,1,25897,R,GARZA MARCOS III,MARY GARZA,2961 N W RAILROAD,,FT STOCKTON,TX,79735,,18M,00,01,31,63,,,,MCP,,,,,False,2961,RAILROAD,NW,FORT STOCKTON,TX,79735,,,,False,False,A1,,,,1.000000,0,0.00,H,,,0.8300,1371        SA&MG SEC 318,EPT-21     BODIE TOWN,,,,,,,,,1250,0,0,0,0,0,0,0,52380,52380,0,0,0,0,0,0,0,0,0,51130,0,0,0,False,0,False,False,0,0,0
2021,00,PECOS COUNTY APPR DIST,1086,00000-00318-03700-000000,1,21060,R,SAN MIGUEL LYDIA,,1207 BARBARA ANN ST,,KERVILLE,TX,78028,3410,18M,00,01,31,63,,,,MCP,,,,,False,276,SMITH,E,FORT STOCKTON,TX,79735,,,,False,False,A2,,,,1.000000,0,0.00,H,,,0.8400,1371        SA&MG SEC 318,TR-25A     BODIE TOWN,,,,,,,,,1260,0,0,0,0,0,0,0,40110,36330,0,0,0,0,0,0,0,0,0,38850,0,0,0,False,0,False,False,0,0,0
2021,00,PECOS COUNTY APPR DIST,1091,00000-00318-04000-000000,1,19181,R,SANCHEZ JAMES ROBERT,,208 E SMITH ST,,FORT STOCKTON,TX,79735,,18M,00,01,31,63,,,,MCP,,,,,False,208,SMITH,E,FORT STOCKTON,TX,79735,,,,False,False,A2,,,,1.000000,0,0.00,,,,0.3400,1371        SA&MG SEC 318,TR -28     BODIE TOWN,,,,,,,,,410,0,0,0,0,0,0,0,91850,91850,0,0,0,0,0,0,0,0,0,91440,0,0,0,False,0,False,False,0,0,0
2021,00,PECOS COUNTY APPR DIST,1132,00000-00509-00102-000000,1,17895,R,THE NATURE CONSERVANCY,,P O BOX 81439,,CORPUS CHRISTI,TX,78468,,18M,00,01,31,63,,,,MCP,,,,,False,,,,,,,,,,False,False,E,,,,1.000000,0,0.00,,,,99.7900,47        GARCIA SEC 509,,,,,,,,,,0,8670,0,0,0,0,0,0,8670,8670,0,0,0,0,0,0,0,0,0,0,0,0,0,False,0,False,False,0,0,0
2021,00,PECOS COUNTY APPR DIST,1136,00000-00551-00300-000000,1,18809,R,WOODWARD BOYD L,DEBBIE WOODWARD,P O BOX 942,,FORT STOCKTON,TX,79735,0942,24M,00,01,32,63,65,,,MCP,,,,,False,,,,,,,,,,False,False,E1,,,,1.000000,0,0.00,H,,,4.0000,1799        G&IM SEC 551,,,,,,,,,,240,0,0,0,0,0,0,0,109110,103330,0,0,0,0,0,0,0,0,0,108870,0,0,0,False,0,False,False,0,0,0
2021,00,PECOS COUNTY APPR DIST,1151,00000-00626-00100-000000,1,25232,R,THE POLLY L BROOKS TRUST,CHIP LOVE TRUSTEE,P O BOX 1323,,MARFA,TX,79843,,18M,00,01,31,63,,,,MCP,,,,,False,,,,,,,,,,False,False,D1,,,,1.000000,0,0.00,,,,339.6200,3169        M SMITH SEC 626,,,,,,,,,,0,0,25790,3000,0,0,0,0,25790,3000,0,0,0,0,0,0,0,0,0,0,0,0,0,False,0,False,False,0,0,0
2021,00,PECOS COUNTY APPR DIST,1155,00000-01004-00101-000000,1,24679,R,WOODWARD ERNEST RANCHES LTD,,HC 73 BOX 29,,MC CAMEY,TX,79752,,12M,00,01,30,63,,,,MCP,,,,,False,,,,,,,,,,False,False,D1,,,,0.180000,0,0.00,,,,42.8400,9103        TC  SEC 4,UND INT,,,,,,,,,0,0,2870,240,0,0,0,0,2870,240,0,0,0,0,0,0,0,0,0,0,0,0,0,False,0,False,False,0,0,0
2021,00,PECOS COUNTY APPR DIST,1160,00000-01004-00106-000000,1,5721,R,GARRO BILLIE GENE,,2013 PEBBLE BEACH COURT,,SAN ANGELO,TX,76904,,12M,00,01,30,63,,,,MCP,,,,,False,,,,,,,,,,False,False,E,,,,0.087100,0,0.00,,,,20.7298,9103        TC  SEC 4,UND INT,,,,,,,,,0,1390,0,0,0,0,0,0,1390,1390,0,0,0,0,0,0,0,0,0,0,0,0,0,False,0,False,False,0,0,0
2021,00,PECOS COUNTY APPR DIST,1170,00000-01070-00800-000000,1,5020,R,LUBY KATHLEEN L,,350 ARGYLE AVE,,SAN ANTONIO,TX,78209,,18M,00,01,31,63,,,,MCP,,,,,False,,,,,,,,,,False,False,D1,,,,0.250000,0,0.00,,,,7.5600,768        C SAVARIA,SEC 70 UND INT,,,,,,,,,0,0,510,40,0,0,0,0,510,40,0,0,0,0,0,0,0,0,0,0,0,0,0,False,0,False,False,0,0,0
2021,00,PECOS COUNTY APPR DIST,1174,00000-01151-00300-000000,1,6339,R,PECOS COUNTY,,103 W CALLAGHAN,,FT STOCKTON,TX,79735,,16M,00,01,31,10,63,,,MCP,,,,,True,,ROONEY PARK OLD MEM HOSP,,FORT STOCKTON,TX,79735,,,,False,False,XV,,,,1.000000,0,0.00,,,,60.5800,40        JOHN FLOOD,,,,,,,,,,0,90870,0,0,0,0,0,0,3361720,0,0,0,0,0,0,0,0,0,0,0,0,3270850,0,False,0,False,False,0,0,0
2021,00,PECOS COUNTY APPR DIST,1177,00000-01225-00200-000000,1,26219,R,TURMAN SAIDOR NEVADA,KENJI SETSON RYE TURMAN,MIKO DYANI TURMAN,384 LAKE SHORE DR,PINE BUSH,NY,12566,7336,18M,00,01,31,63,,,,MCP,,,,,False,,HWY 1053,,FORT STOCKTON,TX,79735,,,,False,False,D1,,,,1.000000,0,0.00,,,,214.6000,744        J LAUX SEC 225,,,,,,,,,,0,0,16860,1490,0,0,0,0,16860,1490,0,0,0,0,0,0,0,0,0,0,0,0,0,False,0,False,False,0,0,0
2021,00,PECOS COUNTY APPR DIST,1198,00000-01519-00100-000000,1,25232,R,THE POLLY L BROOKS TRUST,CHIP LOVE TRUSTEE,P O BOX 1323,,MARFA,TX,79843,,18M,00,01,31,63,,,,MCP,,,,,False,,,,,,,,,,False,False,D1,,,,1.000000,0,0.00,,,,320.0000,33        CCIC SEC 519,,,,,,,,,,0,0,21440,1800,0,0,0,0,21440,1800,0,0,0,0,0,0,0,0,0,0,0,0,0,False,0,False,False,0,0,0
2021,00,PECOS COUNTY APPR DIST,1211,00000-01598-00100-000000,1,882,R,BOYS RANCH FDN,,P O BOX 1890,,AMARILLO,TX,79174,0001,18M,00,01,31,63,,,,MCP,,,,,False,,HWY 1053,,FORT STOCKTON,TX,79735,,,,False,False,D1,,,,0.500000,0,0.00,,,,241.7000,8981        E GESCHEDLE,SEC 598 E PT   UND 1/2 INT,,,,,,,,,0,0,20530,2600,0,0,0,0,20530,2600,0,0,0,0,0,0,0,0,0,0,0,0,0,False,0,False,False,0,0,0
2021,00,PECOS COUNTY APPR DIST,1213,00000-01598-00301-000000,1,23053,R,ALEJUELA INVESTMENTS LLC,,135 WILDROSE AVE,,SAN ANTONIO,TX,78209,,18M,00,01,31,63,,,,MCP,,,,,False,,,,,,,,,,False,False,D1,,,,0.250000,0,0.00,,,,80.0000,9209        E GESCHEIDLE,SEC 598 SW     UND 1/4 INT,,,,,,,,,0,0,5360,560,0,0,0,0,5360,560,0,0,0,0,0,0,0,0,0,0,0,0,0,False,0,False,False,0,0,0
2021,00,PECOS COUNTY APPR DIST,1214,00000-01598-00304-000000,1,4426,R,JOHNSON DWIGHT C,MARJORIE J RAWLINGS IND EX,313 GRANADA ST,,EL PASO,TX,79912,,18M,00,01,31,63,,,,MCP,,,,,False,,,,,,,,,,False,False,D1,,,,0.750000,0,0.00,,,,240.0000,9209        E GESCHEIDLE,SEC 598  SW  UND 3/4 INT,,,,,,,,,0,0,16070,1670,0,0,0,0,16070,1670,0,0,0,0,0,0,0,0,0,0,0,0,0,False,0,False,False,0,0,0
2021,00,PECOS COUNTY APPR DIST,1227,00000-01601-00400-000000,1,2861,R,FROST N/B #301,MYRA S PRYOR TR,LERETA/TX OPERATIONS,P O BOX 35605,DALLAS,TX,75235,,18M,00,01,31,63,,,,MCP,,,,,False,,,,,,,,,,False,False,D1,,,,0.250000,0,0.00,,,,90.8125,6491        N T WILSON,SEC 601 1/2   UND 1/4 INT,,,,,,,,,0,0,6090,510,0,0,0,0,6090,510,0,0,0,0,0,0,0,0,0,0,0,0,0,False,0,False,False,0,0,0
2021,00,PECOS COUNTY APPR DIST,1240,00000-04001-00200-000000,5,20262,R,WESTERN OIL PRODUCERS INC,,P O BOX 2800,,MIDLAND,TX,79702,2800,12M,00,01,30,63,,,,MCP,,,,,False,,,,,,,,,,False,False,E,,,,0.016638,0,0.00,,,,3.5496,3183        T C SEC 1,S 1/3 & N 1/3   UND INT,,,,,,,,,0,300,0,0,0,0,0,0,300,300,0,0,0,0,0,0,0,0,0,0,0,0,0,False,0,False,False,0,0,0
2021,00,PECOS COUNTY APPR DIST,1240,00000-04001-00200-000000,17,18234,R,LEMON CREEK OIL & GAS LTD,,PO BOX 192199,,DALLAS,TX,75219,8514,12M,00,01,30,63,,,,MCP,,,,,False,,,,,,,,,,False,False,E,,,,0.062375,0,0.00,,,,13.3071,3183        T C SEC 1,S 1/3 & N 1/3   UND INT,,,,,,,,,0,1130,0,0,0,0,0,0,1130,1130,0,0,0,0,0,0,0,0,0,0,0,0,0,False,0,False,False,0,0,0
2021,00,PECOS COUNTY APPR DIST,1240,00000-04001-00200-000000,18,21547,R,MOREY FAMILY LLC,,P O BOX 1294,,EDMOND,OK,73083,1294,12M,00,01,30,63,,,,MCP,,,,,False,,,,,,,,,,False,False,E,,,,0.087772,0,0.00,,,,18.7253,3183        T C SEC 1,S 1/3 & N 1/3   UND INT,,,,,,,,,0,1590,0,0,0,0,0,0,1590,1590,0,0,0,0,0,0,0,0,0,0,0,0,0,False,0,False,False,0,0,0
2021,00,PECOS COUNTY APPR DIST,1240,00000-04001-00200-000000,20,22199,R,HIGHLAND ENERGY COMPANY (TEXAS),,11886 GREENVILLE AVE  STE 106,,DALLAS,TX,75243,3569,12M,00,01,30,63,,,,MCP,,,,,False,,,,,,,,,,False,False,E,,,,0.027277,0,0.00,,,,5.8193,3183        T C SEC 1,S 1/3 & N 1/3   UND INT,,,,,,,,,0,500,0,0,0,0,0,0,500,500,0,0,0,0,0,0,0,0,0,0,0,0,0,False,0,False,False,0,0,0
2021,00,PECOS COUNTY APPR DIST,1294,00000-14003-00103-000000,1,2383,R,DURHAM LYNN D JR,,505 N BIG SPRING ST ATE 403,,MIDLAND,TX,79701,,24M,00,01,32,63,65,,,MCP,,,,,False,,,,,,,,,,False,False,E,,,,0.083333,0,0.00,,,,5.5333,9162        FRED TURNER,SEC 3          UND 1/6 OF 1/2,,,,,,,,,0,420,0,0,0,0,0,0,420,420,0,0,0,0,0,0,0,0,0,0,0,0,0,False,0,False,False,0,0,0
2021,00,PECOS COUNTY APPR DIST,1297,00000-14003-00106-000000,1,30053,R,STUARD KATHRYN D LIFETIME TRUST,KATHRYN DURHAM STUARD TRUSTEE,HDS GROUP INC,P O BOX 342543,AUSTIN,TX,78734,0043,24M,00,01,32,63,65,,,MCP,,,,,False,,,,,,,,,,False,False,E,,,,0.083333,0,0.00,,,,5.5333,9162        FRED TURNER,SEC 3          UND 1/6 OF 1/2,,,,,,,,,0,420,0,0,0,0,0,0,420,420,0,0,0,0,0,0,0,0,0,0,0,0,0,False,0,False,False,0,0,0
2021,00,PECOS COUNTY APPR DIST,1304,00000-14004-00106-000000,1,30053,R,STUARD KATHRYN D LIFETIME TRUST,KATHRYN DURHAM STUARD TRUSTEE,HDS GROUP INC,P O BOX 342543,AUSTIN,TX,78734,0043,24M,00,01,32,63,65,,,MCP,,,,,False,,,,,,,,,,False,False,E,,,,0.083333,0,0.00,,,,5.8083,9163        FRED TURNER,SEC 4          UND 1/6 OF 1/2,,,,,,,,,0,350,0,0,0,0,0,0,350,350,0,0,0,0,0,0,0,0,0,0,0,0,0,False,0,False,False,0,0,0
2021,00,PECOS COUNTY APPR DIST,1305,00000-14005-00100-000000,1,8477,R,FRED TURNER MINERALS LTD,RYAN LLC,13155 NOEL ROAD,SUITE 100 LB 78,DALLAS,TX,75240,,24M,00,01,32,63,65,,,MCP,,,,,False,,,,,,,,,,False,False,E,,,,0.500000,0,0.00,,,,70.1000,9164        FRED TURNER,SEC 5          UND 1/2 INT,,,,,,,,,0,5300,0,0,0,0,0,0,5300,5300,0,0,0,0,0,0,0,0,0,0,0,0,0,False,0,False,False,0,0,0
2021,00,PECOS COUNTY APPR DIST,1314,00000-14006-00102-000000,1,2382,R,DURHAM KEVIN D,,505 N BIG SPRING ST STE 403,,MIDLAND,TX,79701,,24M,00,01,32,63,65,,,MCP,,,,,False,,,,,,,,,,False,False,E,,,,0.083333,0,0.00,,,,6.5166,9165        FRED TURNER,SEC 6          UND 1/6 OF 1/2,,,,,,,,,0,490,0,0,0,0,0,0,490,490,0,0,0,0,0,0,0,0,0,0,0,0,0,False,0,False,False,0,0,0
2021,00,PECOS COUNTY APPR DIST,1331,00000-15001-00501-000000,1,646,R,BERGER CHARLES F,KIRKWOOD & DARBY,309 W 7TH ST,SUITE 1020,FT WORTH,TX,76102,,24M,00,01,32,63,65,,,MCP,,,,,False,,,,,,,,,,False,False,E,,,,0.017005,0,0.00,,,,1.5896,9204        BOB REID SEC 1,YATES  UNIT TR 38 SF#13237,UND INT,,,,,,,,0,120,0,0,0,0,0,0,120,120,0,0,0,0,0,0,0,0,0,0,0,0,0,False,0,False,False,0,0,0
2021,00,PECOS COUNTY APPR DIST,1364,00000-15001-00734-000000,1,5436,R,MC MAHON MARSHALL,,767 WEST DRIVE,,MEMPHIS,TN,38112,1726,24M,00,01,32,63,65,,,MCP,,,,,False,,,,,,,,,,False,False,E,,,,0.005826,0,0.00,,,,0.5446,9204        BOB REID SEC 1,YATES  UNIT TR 38  SF#13237,UND INT,,,,,,,,0,40,0,0,0,0,0,0,40,40,0,0,0,0,0,0,0,0,0,0,0,0,0,False,0,False,False,0,0,0
2021,00,PECOS COUNTY APPR DIST,1369,00000-15001-00743-000000,1,2379,R,DURHAM FRED C,HDS GROUP INC,P O BOX 342543,,AUSTIN,TX,78734,0043,24M,00,01,32,63,65,,,MCP,,,,,False,,,,,,,,,,False,False,E,,,,0.024304,0,0.00,,,,2.2719,9204        BOB REID SEC 1,YATES  UNIT TR 38  SF#13237,UND 1/6 OF 1/2 OF .29,,,,,,,,0,170,0,0,0,0,0,0,170,170,0,0,0,0,0,0,0,0,0,0,0,0,0,False,0,False,False,0,0,0
2021,00,PECOS COUNTY APPR DIST,1385,00000-18001-00700-000000,1,23591,R,WOODSTONE RESOURCES LLC,,7500 SAN FELIPE,SUITE 475,HOUSTON,TX,77063,1707,12M,00,01,30,63,,,,MCP,,,,,False,,,,,,,,,,False,False,E,,,,1.000000,0,0.00,,,,116.0000,9378        P PHELP SEC 1,SF 14333,,,,,,,,,0,6990,0,0,0,0,0,0,6990,6990,0,0,0,0,0,0,0,0,0,0,0,0,0,False,0,False,False,0,0,0
2021,00,PECOS COUNTY APPR DIST,1390,00000-21001-00300-000000,1,4114,R,HOLMES BOYD EST,HENRY HOLMES,BOX 774,,IRAAN,TX,79744,0774,24M,00,01,32,63,65,,,MCP,,,,,False,,,,SHEFFIELD,TX,79781,,,,False,False,E1,,,,1.000000,0,0.00,,,,1.6000,5137        A C BEAN,SEC 1 1/2,,,,,,,,,0,110,0,0,0,0,0,0,37880,37880,0,0,0,0,0,0,0,0,0,0,0,37770,0,False,0,False,False,0,0,0
2021,00,PECOS COUNTY APPR DIST,1394,00000-41060-00300-000000,1,15641,R,PECOS COUNTY TRUSTEE,,103 W CALLAGHAN,,FT STOCKTON,TX,79735,,16M,00,01,31,10,63,,,MCP,,,,,True,,RAILROAD,,FORT STOCKTON,TX,79735,,,,False,False,XV,,,,1.000000,0,0.00,,,,15.1020,41        MARIA GUERRA,SEC 204,,,,,,,,,0,286230,0,0,0,0,0,0,295630,0,0,0,0,0,0,0,0,0,0,0,0,9400,0,False,0,False,False,0,0,0
2021,00,PECOS COUNTY APPR DIST,1405,00000-50001-00900-000000,1,26847,R,PARSLEY MINERALS LLC,STANCIL PROPERTY TAX LLC,400 E LAS COLLINS BLVD,SUITE 700,IRVING,TX,75039,,18M,00,01,31,63,,,,MCP,,,,,False,,,,,,,,,,False,False,E,,,,1.000000,0,0.00,,,,53.4000,8123        J C PATTON,SEC 1,,,,,,,,,0,4720,0,0,0,0,0,0,4720,4720,0,0,0,0,0,0,0,0,0,0,0,0,0,False,0,False,False,0,0,0
2021,00,PECOS COUNTY APPR DIST,1407,00000-50001-01101-000000,31,6631,R,PROTESTANT EPSICOPAL,HARDING & CARBONE,1235 NORTH LOOP W,STE 205,HOUSTON,TX,77008,4701,24M,00,01,32,63,65,,,MCP,,,,,False,,,,,,,,,,False,False,E,,,,0.012266,0,0.00,,,,0.2994,9239        J H TYLER,SEC 1        UND INT,SF#13476,,,,,,,,0,20,0,0,0,0,0,0,20,20,0,0,0,0,0,0,0,0,0,0,0,0,0,False,0,False,False,0,0,0
2021,00,PECOS COUNTY APPR DIST,1407,00000-50001-01101-000000,35,6562,R,POWERS CAROL VEITH A,,320 E BLACKBERRY LN,,YORKVILLE,IL,60560,1006,24M,00,01,32,63,65,,,MCP,,,,,False,,,,,,,,,,False,False,E,,,,0.000958,0,0.00,,,,0.0234,9239        J H TYLER,SEC 1        UND INT,SF#13476,,,,,,,,0,0,0,0,0,0,0,0,0,0,0,0,0,0,0,0,0,0,0,0,0,0,0,False,0,False,False,0,0,0