Year,Jurisdiction,Jur_Name,Parcel_ID,Account,Location_Code,Jur1,Jur2,Jur 3,Jur 4,Jur 5,Jur 6,Jur 7,Jur 8,Jur 9,Jur 10,Jur 11,Jur 12,Is_Exempt,Prop_Street_Number,Prop_Street,Prop_Street_Dir,Prop_City,Prop_State,Prop_Zip5,Prop_Zip4,Owner_Id,Owner_Prefix,Name,Careof,Street,Street_Overflow,City,State,Zip5,Zip4,Interest,Ceiling_Year,Ceiling_Tax,Homestead_Code,Agent_Code,Acres,Legal1,Legal2,Legal3,Mortgage_Code,Land_Hs,Land_Nhs,Land_Productivity_Market,Land_1d1,Land_1d,Land_Timber,Personal_Hs,Personal_Nhs,Market_Value,Net_Taxable_Value,State_Homestead,State_Mandated_Over65,State_Mandated_Disabled,Optional65,Local_Disabled,Road_Homestead,Disabled_Veteran,New_Personal_Hs,New_Personal_Nhs,Improvement_Hs,New_Improvement_Hs,Improvement_Nhs,New_Improvement_Nhs,Is_Owner_Confidential,Local_Discount,Map1,Map2,Ownership_Sequence,Is_Protested,Has_Hs_Link,Primary_Category_Code,Secondary_Category_Code,Third_Category_Code,DBA,Has_Abatement,Has_Miscellaneous_Exemption,Name1,Legal4
2020,00,PECOS COUNTY APPR DIST,14,00008-00017-01000-001339,12M,00,01,30,63,,,,MCP,,,,,False,,HWY 1450,,COYANOSA,TX,79730,,893,R,BRADEN KELLEY,ALVIN BRADEN,P O BOX 127,,COYANOSA,TX,79730,0127,1.000000,0,0.00,H,,0.0000,LOCATED        MOBILE HOME,BLK 8   H&GN  SEC 17,,,0,0,0,0,0,0,0,0,26900,22200,0,0,0,0,0,0,0,0,0,26900,0,0,0,False,0,,,1,False,False,M1,,,,False,False,,
2020,00,PECOS COUNTY APPR DIST,15,00001-03063-00900-001352,21M,00,01,32,12,63,65,,MCP,,,,,False,,UNDERWOOD,,IRAAN,TX,79744,,495,R,BARRERA,"CONTRACTORS, INC",220 S MEADOW AVE,,ODESSA,TX,79761,,1.000000,0,0.00,,,0.0000,LOCATED       OFFICE ONLY,INDUSTRIAL PARK,,,0,0,0,0,0,0,0,0,338440,338440,0,0,0,0,0,0,0,0,0,0,0,338440,0,False,0,,,1,False,False,M1,,,,False,False,,
2020,00,PECOS COUNTY APPR DIST,53,00194-00003-01000-002376,24M,00,01,32,63,65,,,MCP,,,,,False,,FM 349,,IRAAN,TX,79744,,3569,R,GRIGSBY RANDY,,P O BOX 235,,IRAAN,TX,79744,0235,1.000000,0,0.00,H,,0.0000,LOCATED MOBILE HOME,BLK 194   SEC 3,,,0,0,0,0,0,0,0,0,67960,60420,0,0,0,0,0,0,0,0,0,67960,0,0,0,False,0,,,1,False,False,E2,,,,False,False,,
2020,00,PECOS COUNTY APPR DIST,59,00018-00011-00100-002541,24M,00,01,32,63,65,,,MCP,,,,,False,,,,,,,,3778,R,HARTMAN RANDAL,,HCR 73 BOX 22,,MC CAMEY,TX,79752,9701,1.000000,0,0.00,H,,0.0000,LOCATED  MOBILE HOME,BLK 18   UNIVERSITY LAND,SEC 11,,0,0,0,0,0,0,0,0,57250,52160,0,0,0,0,0,0,0,0,0,57250,0,0,0,False,0,,,1,False,False,M1,,,,False,False,,
2020,00,PECOS COUNTY APPR DIST,113,00001-08015-04300-003891,18M,00,01,31,63,,,,MCP,,,,,False,,49 LANE,,FORT STOCKTON,TX,79735,,6208,R,PADILLA GERMAN,,1500 N ST GALL,,FT STOCKTON,TX,79735,2401,1.000000,0,0.00,H,,0.0000,LOCATED  MOBILE HOME,E/2-43,BLK 1 FSIL,,0,0,0,0,0,0,0,0,47970,42470,0,0,0,0,0,0,0,0,0,47970,0,0,0,False,0,,,1,False,False,M1,,,,False,False,,SEC 15
2020,00,PECOS COUNTY APPR DIST,169,01460-01700-11000-009402,18M,00,01,31,63,,,,MCP,,,,,False,1397,KILLDEER,,FORT STOCKTON,TX,79735,,17975,R,ORTEGA RUPERTO,,1397 KILDEER LN,,FORT STOCKTON,TX,79735,9443,1.000000,0,0.00,H,,0.0000,LOCATED  RES ONLY,W 200f-11,BLK 17,,0,0,0,0,0,0,0,0,73980,57380,0,0,0,0,0,0,0,0,0,73980,0,0,0,False,0,,,1,False,False,A1,,,,False,False,,MESA VIEW
2020,00,PECOS COUNTY APPR DIST,275,00117-00003-34000-009640,18M,00,01,31,63,,,,MCP,,,,,False,2022,TRAVIS,S,FORT STOCKTON,TX,79735,,3395,R,LECHLER  HILDA,,2062  S TRAVIS,,FT STOCKTON,TX,79735,8992,1.000000,0,0.00,H,,0.0000,LOCATED    MOBILE HOME,NW COR -34,ALAMO,,0,0,0,0,0,0,0,0,30830,27230,0,0,0,0,0,0,0,0,0,30830,0,0,0,False,0,,,1,False,False,M1,,,,False,False,,RANCH
2020,00,PECOS COUNTY APPR DIST,361,01460-01900-07001-009765,18M,00,01,31,63,,,,MCP,,,,,False,1370,ROBIN,,FORT STOCKTON,TX,79735,,2942,R,GALINDO JESUS M ETUX,,1360 ROBIN LANE,,FORT STOCKTON,TX,79735,9674,1.000000,0,0.00,,,0.0000,LOCATED      MOBILE HOME,MID PT-4,BLK 19,,0,0,0,0,0,0,0,0,3330,3330,0,0,0,0,0,0,0,0,0,0,0,3330,0,False,0,,,1,False,False,M1,,,,False,False,,MESA VIEW
2020,00,PECOS COUNTY APPR DIST,416,00000-00008-50174-000000,16M,00,01,31,10,63,,,MCP,,,,,False,124,MAIN,N,FORT STOCKTON,TX,79735,,27953,R,CASA DE MODAS,AMY TERRAZAS,116 N MAIN,,FORT STOCKTON,TX,79735,,1.000000,0,0.00,,,0.0000,"INV, FURN, EQUIP",,,,0,0,0,0,0,0,0,7200,7200,7200,0,0,0,0,0,0,0,0,0,0,0,0,0,False,0,,,1,False,False,L1,,,,False,False,,
2020,00,PECOS COUNTY APPR DIST,421,00000-00008-50198-000000,16M,00,01,31,10,63,,,MCP,,,,,False,701,MAIN,N,FORT STOCKTON,TX,79735,,1762,R,CORDERO P M,,P O BOX 1605,,FORT STOCKTON,TX,79735,,1.000000,0,0.00,,,0.0000,"INV, FURN & EQUIP",,,,0,0,0,0,0,0,0,7000,7000,7000,0,0,0,0,0,0,0,0,0,0,0,0,0,False,0,,,1,False,False,L1,,,,False,False,,
2020,00,PECOS COUNTY APPR DIST,496,00000-00008-50638-000000,16M,00,01,31,10,63,,,MCP,,,,,False,1406,FRONT,N,FORT STOCKTON,TX,79735,,4392,R,JESSIES BARBER SHOP,JESSIE QUINTELA,1303 N GATLIN ST,,FT STOCKTON,TX,79735,7426,1.000000,0,0.00,,,0.0000,FURN & EQUIP,,,,0,0,0,0,0,0,0,500,500,500,0,0,0,0,0,0,0,0,0,0,0,0,0,False,0,,,1,False,False,L1,,,,False,False,,
2020,00,PECOS COUNTY APPR DIST,592,00000-00008-51236-000000,08M,00,01,12,32,63,65,,MCP,,,,,False,100,SIXTH,E,IRAAN,TX,79744,,27345,R,STRIPES #5013,K E ANDREWS,1900 DALROCK RD,,ROWLETT,TX,75088,,1.000000,0,0.00,,,0.0000,"INV, FURN & EQUIP",,,,0,0,0,0,0,0,0,119580,119580,119580,0,0,0,0,0,0,0,0,0,0,0,0,0,False,0,,,1,False,False,L1,,,,False,False,,
2020,00,PECOS COUNTY APPR DIST,614,00000-00008-51402-000000,16M,00,01,31,10,63,,,MCP,,,,,False,,,,FORT STOCKTON,TX,79735,,9263,R,XEROX CORPORATION,PROPERTY TAX XRX2-040A,P O BOX 9601,,WEBSTER,NY,14580,,1.000000,0,0.00,,,0.0000,LEASED EQUIPMENT,,,,0,0,0,0,0,0,0,49684,49684,49684,0,0,0,0,0,0,0,0,0,0,0,0,0,False,0,,,1,False,False,L1,,,,False,False,,
2020,00,PECOS COUNTY APPR DIST,668,00000-00009-22170-000000,16M,00,01,31,10,63,,,MCP,,,,,False,603,MAIN,N,FORT STOCKTON,TX,79735,,6293,R,TRANS PECOS EYECARE,"OF FORT STOCKTON, PLLC",JOSH R PASS & HULON H,P O BOX 1568,FT STOCKTON,TX,79735,1568,1.000000,0,0.00,,,0.0000,"FF&E, INV",,,,0,0,0,0,0,0,0,212000,212000,212000,0,0,0,0,0,0,0,0,0,0,0,0,0,False,0,,,1,False,False,L1,,,,False,False,,
2020,00,PECOS COUNTY APPR DIST,758,00000-00009-43112-000000,16M,00,01,31,10,63,,,MCP,,,,,False,903,BUTZ,N,FORT STOCKTON,TX,79735,,6915,R,REXS BOOT REPAIR,REX CARPENTER,P O BOX 308,,FT STOCKTON,TX,79735,5124,1.000000,0,0.00,,,0.0000,"FF&E,INV",,,,0,0,0,0,0,0,0,7400,7400,7400,0,0,0,0,0,0,0,0,0,0,0,0,0,False,0,,,1,False,False,L1,,,,False,False,,
2020,00,PECOS COUNTY APPR DIST,867,00000-00009-66036-000000,16M,00,01,31,10,63,,,MCP,,,,,False,601,DICKINSON,E,FORT STOCKTON,TX,79735,,5201,R,MARTINS TIRE SHOP,MARTIN SALAMANCA,601 E DICKINSON,,FT STOCKTON,TX,79735,4313,1.000000,0,0.00,,,0.0000,"FF&E,INV",,,,0,0,0,0,0,0,0,3600,3600,3600,0,0,0,0,0,0,0,0,0,0,0,0,0,False,0,,,1,False,False,L1,,,,False,False,,
2020,00,PECOS COUNTY APPR DIST,974,00000-00050-00900-000000,18M,00,01,31,63,,,,MCP,,,,,False,,,,,,,,26630,R,BESS INVESTMENTS LP,,13619 INWOOD RD,SUITE 320,FARMERS BRANCH,TX,75244,,0.633332,0,0.00,,,82.0160,2150     B NOBLE SEC 50   TK 1,UND INT,,,0,0,6890,760,0,0,0,0,6890,760,0,0,0,0,0,0,0,0,0,0,0,0,0,False,0,,,1,False,False,D1,,,,False,False,,
2020,00,PECOS COUNTY APPR DIST,978,00000-00050-01200-000000,18M,00,01,31,63,,,,MCP,,,,,False,,HWY 385,,FORT STOCKTON,TX,79735,,27324,R,W T BYLER HOLDINGS COMPANY LP,,15203 LILLJA ROAD,,HOUSTON,TX,77060,,0.182288,0,0.00,,,70.8190,2150    B NOBLE SEC 50   E/2,UND INT,,,0,0,6540,900,0,0,0,0,6540,900,0,0,0,0,0,0,0,0,0,0,0,0,0,False,0,,,1,False,False,D1,,,,False,False,,
2020,00,PECOS COUNTY APPR DIST,980,00000-00050-01301-000000,18M,00,01,31,63,,,,MCP,,,,,False,,,,,,,,8150,R,TALLEY LISA D &,JESSE L TALLEY,718 THOMPSON LANE,SUITE 108-223,NASHVILLE,TN,37204,3600,0.062500,0,0.00,,,24.2810,2150    B NOBLE SEC 50  E/2,UND 1/16 OF E/2,,,0,2240,0,0,0,0,0,0,2240,2240,0,0,0,0,0,0,0,0,0,0,0,0,0,False,0,,,1,False,False,E,,,,False,False,,
2020,00,PECOS COUNTY APPR DIST,981,00000-00050-01302-000000,18M,00,01,31,63,,,,MCP,,,,,False,,,,,,,,3520,R,GRAYKEN KATE WILSON,,3801 BEDFORD AVE STE 100,,NASHVILLE,TN,37215,2562,0.138888,0,0.00,,,53.9580,2150    B NOBLE SEC 50  E/2,UND 2/3 OF 5/24OF E/2,,,0,4990,0,0,0,0,0,0,4990,4990,0,0,0,0,0,0,0,0,0,0,0,0,0,False,0,,,1,False,False,E,,,,False,False,,
2020,00,PECOS COUNTY APPR DIST,982,00000-00050-01303-000000,18M,00,01,31,63,,,,MCP,,,,,False,,,,,,,,4432,R,GRAYKEN KATE W ETAL,KATE GRAYKEN,3801 BEDFORD AVE  STE 100,,NASHVILLE,TN,37215,2562,0.069443,0,0.00,,,26.9790,2150   B NOBLE SEC 50  E/2,UND 1/3 OF 5/24OF E/2,,,0,2490,0,0,0,0,0,0,2490,2490,0,0,0,0,0,0,0,0,0,0,0,0,0,False,0,,,1,False,False,E,,,,False,False,,
2020,00,PECOS COUNTY APPR DIST,1008,00000-00216-00501-000000,18M,00,01,31,63,,,,MCP,,,,,False,967,OLD CEMETARY,,FORT STOCKTON,TX,79735,,758,R,BLANCO DANIEL R,LENORE,5020 JOY DR,,MIDLAND,TX,79703,,1.000000,0,0.00,,,0.6000,53        J H HERNDON,SEC 216,,,860,0,0,0,0,0,0,0,100830,100830,0,0,0,0,0,0,0,0,0,99970,0,0,0,False,0,,,1,False,False,A1,,,,False,False,,
2020,00,PECOS COUNTY APPR DIST,1011,00000-00216-00700-000000,18M,00,01,31,63,,,,MCP,,,,,False,,HWY 385,,FORT STOCKTON,TX,79735,,26906,R,PARSLEY ENERGY LP,STANCIL PROPERTY TAX LLC,400 E LAS COLLINS BLVD,SUITE 700,IRVING,TX,75039,,1.000000,0,0.00,,,1.3800,53        J H HERNDON,SEC 216,,,0,1730,0,0,0,0,0,0,1730,1730,0,0,0,0,0,0,0,0,0,0,0,0,0,False,0,,,1,False,False,C1,,,,False,False,,
2020,00,PECOS COUNTY APPR DIST,1015,00000-00216-00900-000000,18M,00,01,31,63,,,,MCP,,,,,False,972,OLD CEMETERY,,FORT STOCKTON,TX,79735,,23530,R,GARRISON GREGORY AND LUCY,,901 GONZALEZ  LOOP,,FORT STOCKTON,TX,79735,7803,1.000000,0,0.00,,,0.4600,53        J H HERNDON,SEC 216,,,0,660,0,0,0,0,0,0,25700,25700,0,0,0,0,0,0,0,0,0,0,0,25040,0,False,0,,,1,False,False,A2,,,,False,False,,
2020,00,PECOS COUNTY APPR DIST,1024,00000-00216-01700-000000,18M,00,01,31,63,,,,MCP,,,,,False,765,CEMETERY ROAD,,FORT STOCKTON,TX,79735,,7150,R,RODRIGUEZ MARCELINO,PATRICIA,P O BOX 531,,FT STOCKTON,TX,79735,0531,1.000000,0,0.00,H,,0.2700,53    J H HERNDON,SEC 216,,,390,0,0,0,0,0,0,0,56280,56280,0,0,0,0,0,0,0,0,0,55890,0,0,0,False,0,,,1,False,False,A1,,,,False,False,,
2020,00,PECOS COUNTY APPR DIST,1046,00000-00318-00101-000000,18M,00,01,31,63,,,,MCP,,,,,False,144,39 LANE,E,FORT STOCKTON,TX,79735,,22536,R,HAGY ERNESTINA V,,P O BOX 1425,,FT STOCKTON,TX,79735,1425,1.000000,0,0.00,H,,0.4080,1371        SA&MG  SEC 318,TR 1        BODIE TOWN,,,610,0,0,0,0,0,0,0,26170,25760,0,0,0,0,0,0,0,0,0,25560,0,0,0,False,0,,,1,False,False,A1,,,,False,False,,
2020,00,PECOS COUNTY APPR DIST,1076,00000-00318-02900-000000,18M,00,01,31,63,,,,MCP,,,,,False,315,SMITH,E,FORT STOCKTON,TX,79735,,5104,R,MADRID ALFREDO R,,315 E SMITH ST,,FT STOCKTON,TX,79735,8930,1.000000,0,0.00,,,0.8300,1371     SA&MG SEC 318,TR -17     BODIE TOWN,,,1250,0,0,0,0,0,0,0,123670,123670,0,0,0,0,0,0,0,0,0,74600,0,47820,0,False,0,,,1,False,False,A1,,,,False,False,,
2020,00,PECOS COUNTY APPR DIST,1095,00000-00318-04310-000000,18M,00,01,31,63,,,,MCP,,,,,True,,SMITH,,,,,,6339,R,PECOS COUNTY,,103 W CALLAGHAN,,FT STOCKTON,TX,79735,,1.000000,0,0.00,,,0.2100,1371        SA&MG SEC 318,WPT -30     BODIE TOWN,& -31,,0,250,0,0,0,0,0,0,250,0,0,0,0,0,0,0,0,0,0,0,0,0,0,False,0,,,1,False,False,XV,,,,False,False,,
2020,00,PECOS COUNTY APPR DIST,1098,00000-00318-04600-000000,18M,00,01,31,63,,,,MCP,,,,,False,,G,,FORT STOCKTON,TX,79735,,4399,R,JIMENEZ MARGARITO F,,P O BOX 1175,,FT STOCKTON,TX,79735,1175,1.000000,0,0.00,,,0.2990,1371        SA&MG SEC 318,TR-31A      BODIE TOWN,PT-31,,0,400,0,0,0,0,0,0,400,400,0,0,0,0,0,0,0,0,0,0,0,0,0,False,0,,,1,False,False,C1,,,,False,False,,
2020,00,PECOS COUNTY APPR DIST,1112,00000-00318-06100-000000,18M,00,01,31,63,,,,MCP,,,,,False,,G,E,FORT STOCKTON,TX,79735,,28813,R,KOPACZ CHRISTINA LYNN,,23409 TRES CORONAS,,SPICEWOOD,TX,78669,1573,1.000000,0,0.00,,,2.3400,1371        SA&MG SEC 318,PT -43     BODIE TOWN,,,0,2160,0,0,0,0,0,0,2160,2160,0,0,0,0,0,0,0,0,0,0,0,0,0,False,0,,,1,False,False,C1,,,,False,False,,
2020,00,PECOS COUNTY APPR DIST,1117,00000-00318-06400-000000,18M,00,01,31,63,,,,MCP,,,,,False,136,G ST,E,FORT STOCKTON,TX,79735,,25740,R,MONTOYA ANA EIDA,,4168 N ALAMO,,FT STOCKTON,TX,79735,,1.000000,0,0.00,,,0.2700,1371        SA&MG SEC 318,PT-44     BODIE TOWN,,,0,810,0,0,0,0,0,0,4210,4210,0,0,0,0,0,0,0,0,0,3400,0,0,0,False,0,,,1,False,False,A3,,,,False,False,,
2020,00,PECOS COUNTY APPR DIST,1119,00000-00318-06700-000000,18M,00,01,31,63,,,,MCP,,,,,False,,HWY 1053,,FORT STOCKTON,TX,79735,,5020,R,LUBY KATHLEEN L,,350 ARGYLE AVE,,SAN ANTONIO,TX,78209,,1.000000,0,0.00,,,2.5100,1371        SA&MG SEC 318,TR -46     BODIE TOWN,,,0,7530,0,0,0,0,0,0,7530,7530,0,0,0,0,0,0,0,0,0,0,0,0,0,False,0,,,1,False,False,C1,,,,False,False,,
2020,00,PECOS COUNTY APPR DIST,1125,00000-00318-07800-000000,18M,00,01,31,63,,,,MCP,,,,,False,3233,HWY 1053,,FORT STOCKTON,TX,79735,,22913,R,ALARCON JESUS AGUSTIN MARTINEZ,,1901 N FRONT,,FT STOCKTON,TX,79735,2822,1.000000,0,0.00,,,1.0000,1371        SA&MG SEC 318,BODIE TOWN,,,0,1000,0,0,0,0,0,0,72410,72410,0,0,0,0,0,0,0,0,0,71410,0,0,0,False,0,,,1,False,False,A2,,,,False,False,,
2020,00,PECOS COUNTY APPR DIST,1137,00000-00551-00400-000000,24M,00,01,32,63,65,,,MCP,,,,,False,28,MILES E I-10,,FORT STOCKTON,TX,79735,,9300,R,YEAGER PAUL W,,171 TUNAS CREEK RD,,MC CAMEY,TX,79752,9709,1.000000,0,0.00,H,,8.7100,1799        G&IM SEC 551,,,,530,0,0,0,0,0,0,0,139020,128030,0,0,0,0,0,0,0,0,0,138490,0,0,0,False,0,,,1,False,False,E1,,,,False,False,,
2020,00,PECOS COUNTY APPR DIST,1162,00000-01068-00100-000000,18M,00,01,31,63,,,,MCP,,,,,False,,,,,,,,25232,R,THE POLLY L BROOKS TRUST,POLLY BROOKS AS TRUSTEE OF TRUST,P O BOX 1323,,MARFA,TX,79843,,1.000000,0,0.00,,,159.8600,56        E  HERNANDEZ,SEC 68,,,0,0,10710,900,0,0,0,0,10710,900,0,0,0,0,0,0,0,0,0,0,0,0,0,False,0,,,1,False,False,D1,,,,False,False,,
2020,00,PECOS COUNTY APPR DIST,1172,00000-01151-00100-000000,16M,00,01,31,10,63,,,MCP,,,,,True,,,,,,,,1570,R,CITY OF FT STOCKTON,,P O BOX 1000,,FT STOCKTON,TX,79735,,1.000000,0,0.00,,,7.0800,40        JOHN FLOOD,,,,0,10620,0,0,0,0,0,0,251730,0,0,0,0,0,0,0,0,0,0,0,0,241110,0,False,0,,,1,False,False,XV,,,,False,False,,
2020,00,PECOS COUNTY APPR DIST,1180,00000-01307-00100-000000,18M,00,01,31,63,,,,MCP,,,,,False,,,,,,,,25232,R,THE POLLY L BROOKS TRUST,POLLY BROOKS AS TRUSTEE OF TRUST,P O BOX 1323,,MARFA,TX,79843,,1.000000,0,0.00,,,322.4500,20        J CHAMPAGNE,SEC 307,,,0,0,23690,2680,0,0,0,0,23690,2680,0,0,0,0,0,0,0,0,0,0,0,0,0,False,0,,,1,False,False,D1,,,,False,False,,
2020,00,PECOS COUNTY APPR DIST,1190,00000-01513-00100-000000,18M,00,01,31,63,,,,MCP,,,,,False,,,,,,,,28597,R,SEVEN MILE MESA LLC,A TEXAS LIMITED LIABILITY,706 PINEHURST DRIVE,,MIDLAND,TX,79705,,1.000000,0,0.00,,,185.0600,30        CCIC SEC 513,UND INT,,,0,0,11160,1040,0,0,0,0,11160,1040,0,0,0,0,0,0,0,0,0,0,0,0,0,False,0,,,1,False,False,D1,,,,False,False,,
2020,00,PECOS COUNTY APPR DIST,1209,00000-01548-00100-000000,18M,00,01,31,63,,,,MCP,,,,,False,,,,,,,,28597,R,SEVEN MILE MESA LLC,A TEXAS LIMITED LIABILITY,706 PINEHURST DRIVE,,MIDLAND,TX,79705,,1.000000,0,0.00,,,320.0000,4314        TORRES I&M,SEC 548      UND INT,,,0,0,28010,3120,0,0,0,0,28010,3120,0,0,0,0,0,0,0,0,0,0,0,0,0,False,0,,,1,False,False,D1,,,,False,False,,
2020,00,PECOS COUNTY APPR DIST,1217,00000-01599-00100-000000,18M,00,01,31,63,,,,MCP,,,,,False,,,,,,,,25232,R,THE POLLY L BROOKS TRUST,POLLY BROOKS AS TRUSTEE OF TRUST,P O BOX 1323,,MARFA,TX,79843,,1.000000,0,0.00,,,1303.0200,2714        P H FALL,SEC 599,,,0,0,131670,18240,0,0,0,0,131670,18240,0,0,0,0,0,0,0,0,0,0,0,0,0,False,0,,,1,False,False,D1,,,,False,False,,
2020,00,PECOS COUNTY APPR DIST,1234,00000-02003-00100-000000,12M,00,01,30,63,,,,MCP,,,,,False,,,,,,,,24679,R,WOODWARD ERNEST RANCHES LTD,,HC 73 BOX 29,,MC CAMEY,TX,79752,,0.250000,0,0.00,,,39.6650,3184        T C SEC 3,N/3 AND M/3,,,0,0,3500,370,0,0,0,0,3500,370,0,0,0,0,0,0,0,0,0,0,0,0,0,False,0,,,2,False,False,D1,,,,False,False,,
2020,00,PECOS COUNTY APPR DIST,1240,00000-04001-00200-000000,12M,00,01,30,63,,,,MCP,,,,,False,,,,,,,,21546,R,PRODUCTION GATHERING CO  LP,,8150 N CENTRAL EXPY STE 1475,,DALLAS,TX,75206,0506,0.062375,0,0.00,,,13.3070,3183        T C SEC 1,S 1/3 & N 1/3   UND INT,,,0,1130,0,0,0,0,0,0,1130,1130,0,0,0,0,0,0,0,0,0,0,0,0,0,False,0,,,16,False,False,E,,,,False,False,,
2020,00,PECOS COUNTY APPR DIST,1240,00000-04001-00200-000000,12M,00,01,30,63,,,,MCP,,,,,False,,,,,,,,21548,R,EETRADECO CAPITAL II,,4144 N CENTRAL EXPY STE 600,,DALLAS,TX,75204,3131,0.023780,0,0.00,,,5.0730,3183        T C SEC 1,S 1/3 & N 1/3   UND INT,,,0,430,0,0,0,0,0,0,430,430,0,0,0,0,0,0,0,0,0,0,0,0,0,False,0,,,19,False,False,E,,,,False,False,,
2020,00,PECOS COUNTY APPR DIST,1252,00000-08001-00200-000000,18M,00,01,31,63,,,,MCP,,,,,False,,,,,,,,21111,R,LONG FELLOW RANCH PARTNERS LP,,P O BOX 1989,,ADDISON,TX,75001,1989,1.000000,0,0.00,,,162.6100,9334        SF 13942 SEC 1,,,,0,0,11620,1060,0,0,0,0,11620,1060,0,0,0,0,0,0,0,0,0,0,0,0,0,False,0,,,1,False,False,D1,,,,False,False,,
2020,00,PECOS COUNTY APPR DIST,1254,00000-08002-00500-000000,18M,00,01,31,63,,,,MCP,,,,,False,,,,,,,,21053,R,LONGFELLOW RANCH PARTNERS L P,,P O BOX 1989,,ADDISON,TX,75001,,1.000000,0,0.00,,,640.0000,8058        T C  SEC 2,,,,0,0,53760,5930,0,0,0,0,53760,5930,0,0,0,0,0,0,0,0,0,0,0,0,0,False,0,,,1,False,False,D1,,,,False,False,,
2020,00,PECOS COUNTY APPR DIST,1274,00000-13541-01400-000000,18M,00,01,31,63,,,,MCP,,,,,False,,,,,,,,24393,R,YOUNG FRANCIS,,11611 PAGANICA WAY NE,,ALBUQUERQUE,NM,87111,7509,0.050000,0,0.00,,,21.5000,589        H&GN  SEC 541,S PT         UND 1/10 INT,,,0,2110,0,0,0,0,0,0,2110,2110,0,0,0,0,0,0,0,0,0,0,0,0,0,False,0,,,1,False,False,E,,,,False,False,,
2020,00,PECOS COUNTY APPR DIST,1284,00000-14002-00100-000000,24M,00,01,32,63,65,,,MCP,,,,,False,,,,,,,,8477,R,FRED TURNER MINERALS LTD,RYAN LLC,13155 NOEL ROAD,SUITE 100 LB 78,DALLAS,TX,75240,,0.500000,0,0.00,,,33.1500,9161        FRED TURNER,SEC 2          UND 1/2 INT,,,0,2510,0,0,0,0,0,0,2510,2510,0,0,0,0,0,0,0,0,0,0,0,0,0,False,0,,,1,False,False,E,,,,False,False,,
2020,00,PECOS COUNTY APPR DIST,1285,00000-14002-00101-000000,24M,00,01,32,63,65,,,MCP,,,,,False,,,,,,,,2379,R,DURHAM FRED C,HDS GROUP INC,P O BOX 342543,,AUSTIN,TX,78734,0043,0.083333,0,0.00,,,5.5250,9161        FRED TURNER,SEC 2          UND 1/6 OF 1/2,,,0,420,0,0,0,0,0,0,420,420,0,0,0,0,0,0,0,0,0,0,0,0,0,False,0,,,1,False,False,E,,,,False,False,,
2020,00,PECOS COUNTY APPR DIST,1299,00000-14004-00101-000000,24M,00,01,32,63,65,,,MCP,,,,,False,,,,,,,,2379,R,DURHAM FRED C,HDS GROUP INC,P O BOX 342543,,AUSTIN,TX,78734,0043,0.083333,0,0.00,,,5.8080,9163        FRED TURNER,SEC 4          UND 1/6 OF 1/2,,,0,350,0,0,0,0,0,0,350,350,0,0,0,0,0,0,0,0,0,0,0,0,0,False,0,,,1,False,False,E,,,,False,False,,
2020,00,PECOS COUNTY APPR DIST,1323,00000-15001-00103-000000,24M,00,01,32,63,65,,,MCP,,,,,False,,,,,,,,2383,R,DURHAM LYNN D JR,,505 N BIG SPRING ST ATE 403,,MIDLAND,TX,79701,,0.083333,0,0.00,,,0.3290,9204        BOB REID SEC 1,SF#13237  UND 1/6 OF 1/2,YATES  UNIT TR 112 & 113,,0,30,0,0,0,0,0,0,30,30,0,0,0,0,0,0,0,0,0,0,0,0,0,False,0,,,1,False,False,E,,,,False,False,,
2020,00,PECOS COUNTY APPR DIST,1356,00000-15001-00725-000000,24M,00,01,32,63,65,,,MCP,,,,,False,,,,,,,,3686,R,HANGER R K TRST #2143,RYAN LLC,P O BOX 460329   DEPT 909,,HOUSTON,TX,77056,,0.049497,0,0.00,,,4.6270,9204        BOB REID SEC 1,YATES  UNIT TR 38  SF#13237,UND INT,,0,0,350,40,0,0,0,0,350,40,0,0,0,0,0,0,0,0,0,0,0,0,0,False,0,,,1,False,False,D1,,,,False,False,,
2020,00,PECOS COUNTY APPR DIST,1364,00000-15001-00734-000000,24M,00,01,32,63,65,,,MCP,,,,,False,,,,,,,,5436,R,MC MAHON MARSHALL,,767 WEST DRIVE,,MEMPHIS,TN,38112,1726,0.005826,0,0.00,,,0.5450,9204        BOB REID SEC 1,YATES  UNIT TR 38  SF#13237,UND INT,,0,40,0,0,0,0,0,0,40,40,0,0,0,0,0,0,0,0,0,0,0,0,0,False,0,,,1,False,False,E,,,,False,False,,
2020,00,PECOS COUNTY APPR DIST,1376,00000-18001-00100-000000,12M,00,01,30,63,,,,MCP,,,,,False,,,,,,,,22790,R,CROCKETT REESE,PROPERTIES LLC,6707 BARBERRY PLACE,,CARLSBAD,NM,92011,,0.500000,0,0.00,,,98.7000,9379        PHELPS SEC 1,UND 1/2 INT,,,0,5950,0,0,0,0,0,0,5950,5950,0,0,0,0,0,0,0,0,0,0,0,0,0,False,0,,,1,False,False,E,,,,False,False,,
2020,00,PECOS COUNTY APPR DIST,1379,00000-18001-00201-000000,12M,00,01,30,63,,,,MCP,,,,,False,,,,,,,,22789,R,E A GIRAUD-BELL,LIMITED PARTNERSHIP,P O BOX 5431,,SANTA BARBARA,CA,93150,5431,0.500000,0,0.00,,,133.5000,9380  SEC 1 P PHELPS,UND 1/2 INT,,,0,8050,0,0,0,0,0,0,8050,8050,0,0,0,0,0,0,0,0,0,0,0,0,0,False,0,,,1,False,False,E,,,,False,False,,
2020,00,PECOS COUNTY APPR DIST,1398,00000-50001-00200-000000,18M,00,01,31,63,,,,MCP,,,,,False,,,,,,,,28597,R,SEVEN MILE MESA LLC,A TEXAS LIMITED LIABILITY,706 PINEHURST DRIVE,,MIDLAND,TX,79705,,1.000000,0,0.00,,,9.0000,4543        A Q CLEMENTS,SEC 1      UND INT,,,0,0,880,110,0,0,0,0,880,110,0,0,0,0,0,0,0,0,0,0,0,0,0,False,0,,,1,False,False,D1,,,,False,False,,
2020,00,PECOS COUNTY APPR DIST,1407,00000-50001-01101-000000,24M,00,01,32,63,65,,,MCP,,,,,False,,,,,,,,258,R,ANGELO JOAN M,ANTHONY  ANGELO,2632 4TH AVE,,SACRAMENTO,CA,95818,3232,0.000958,0,0.00,,,0.0230,9239        J H TYLER,SEC 1        UND INT,SF#13476,,0,0,0,0,0,0,0,0,0,0,0,0,0,0,0,0,0,0,0,0,0,0,0,False,0,,,39,False,False,E,,,,False,False,,
2020,00,PECOS COUNTY APPR DIST,1407,00000-50001-01101-000000,24M,00,01,32,63,65,,,MCP,,,,,False,,,,,,,,545,R,BAUR ODGEN JR,,661 COUNTY ROAD 548,,HONDO,TX,78861,5609,0.009200,0,0.00,,,0.2250,9239        J H TYLER,SEC 1        UND INT,SF#13476,,0,20,0,0,0,0,0,0,20,20,0,0,0,0,0,0,0,0,0,0,0,0,0,False,0,,,43,False,False,E,,,,False,False,,
2020,00,PECOS COUNTY APPR DIST,1407,00000-50001-01101-000000,24M,00,01,32,63,65,,,MCP,,,,,False,,,,,,,,2679,R,FISK PATRICIA A L,,7644 NUNES ROAD,,DIXON,CA,95620,9771,0.000958,0,0.00,,,0.0230,9239        J H TYLER,SEC 1        UND INT,SF#13476,,0,0,0,0,0,0,0,0,0,0,0,0,0,0,0,0,0,0,0,0,0,0,0,False,0,,,37,False,False,E,,,,False,False,,
2020,00,PECOS COUNTY APPR DIST,1407,00000-50001-01101-000000,24M,00,01,32,63,65,,,MCP,,,,,False,,,,,,,,20934,R,BAUR AUNNIE LLC,"JOHN CLARKE, MANAGER",23501 JOSEPH RD,,HOCKLEY,TX,77447,8602,0.009200,0,0.00,,,0.2250,9239        J H TYLER,SEC 1        UND INT,SF#13476,,0,20,0,0,0,0,0,0,20,20,0,0,0,0,0,0,0,0,0,0,0,0,0,False,0,,,68,False,False,E,,,,False,False,,
2020,00,PECOS COUNTY APPR DIST,1407,00000-50001-01101-000000,24M,00,01,32,63,65,,,MCP,,,,,False,,,,,,,,22876,R,DECORDOVA LISA,,8875  FM  66,,GRANDVIEW,TX,76050,6810,0.000745,0,0.00,,,0.0180,9239        J H TYLER,SEC 1        UND INT,SF#13476,,0,0,0,0,0,0,0,0,0,0,0,0,0,0,0,0,0,0,0,0,0,0,0,False,0,,,73,False,False,E,,,,False,False,,
2020,00,PECOS COUNTY APPR DIST,1407,00000-50001-01101-000000,24M,00,01,32,63,65,,,MCP,,,,,False,,,,,,,,25885,R,BENSON JEWELL LINCOLN,,3266 S U S HWY 385,,LEVELLAND,TX,79336,,0.010000,0,0.00,,,0.2440,9239        J H TYLER,SEC 1        UND INT,SF#13476,,0,20,0,0,0,0,0,0,20,20,0,0,0,0,0,0,0,0,0,0,0,0,0,False,0,,,15,False,False,E,,,,False,False,,
2020,00,PECOS COUNTY APPR DIST,1465,00000-50001-01300-000000,12M,00,01,30,63,,,,MCP,,,,,False,,,,,,,,2613,R,FARMCRAFT PROPERTIES,INC.,1728 HIGHWAY 3226,,DERIDDER,LA,70634,9128,1.000000,0,0.00,,,27.1000,9543        P HINYARD SEC 1,,,,0,0,1820,150,0,0,0,0,1820,150,0,0,0,0,0,0,0,0,0,0,0,0,0,False,0,,,1,False,False,D1,,,,False,False,,
2020,00,PECOS COUNTY APPR DIST,1469,00000-50003-00100-000000,18M,00,01,31,63,,,,MCP,,,,,False,,,,,,,,25232,R,THE POLLY L BROOKS TRUST,POLLY BROOKS AS TRUSTEE OF TRUST,P O BOX 1323,,MARFA,TX,79843,,1.000000,0,0.00,,,319.4500,4553        C L DE GOMEZ,SEC 3,,,0,0,31340,4070,0,0,0,0,31340,4070,0,0,0,0,0,0,0,0,0,0,0,0,0,False,0,,,1,False,False,D1,,,,False,False,,
2020,00,PECOS COUNTY APPR DIST,1484,00001-01019-00105-000000,18M,00,01,31,63,,,,MCP,,,,,False,,,,,,,,23913,R,MADDOX RANCH LTD,HARDING & CARBONE,1235 NORTH LOOP WEST,SUITE 205,HOUSTON,TX,77008,,0.500000,0,0.00,,,258.6650,668  1 H&TC SEC 19,UND 1/2 INT,,,0,0,21670,1460,0,0,0,0,21670,1460,0,0,0,0,0,0,0,0,0,0,0,0,0,False,0,,,1,False,False,D1,,,,False,False,,